{"text_format":"3","workbook":"xlsx","n_sheets":15,"sheets":["Sheet1","Sheet2","Sheet3","Sheet4","Sheet5","Sheet6","Sheet7","Sheet8","Sheet9","Sheet10","Sheet11","Sheet12","Sheet13","Sheet14","Sheet15"],"not_rendered":{"images":7,"macros":1,"external_links":1,"defined_names":13},"read":"whole","date_system":"1900"}

{"sheet":"Sheet1","index":0,"n_rows":0,"n_cols":0,"rows_kept":0}

{"sheet":"Sheet2","index":1,"n_rows":60,"n_cols":8,"rows_kept":60,"merged":[[0,0,0,7],[1,0,1,7],[2,0,2,7],[3,0,3,7],[4,0,4,7],[5,0,5,7],[6,0,6,7],[7,0,7,7],[8,0,9,0],[8,1,9,1],[8,2,9,2],[8,3,9,3],[8,4,8,5],[8,6,9,6],[8,7,9,7]]}
["vkgj.k ,oa forj.k vf/kdkjh dk;kZy;↓"]
["iz/kkukpk;Z de ihbZbZvks] jktdh; mPp ek/;fed fon~;ky; ekywrkuk ¼Fkkukxkth½ vyoj"]
["lkef;d osru o`f) o\"kZ↓"]
[2024]
["Lohd`rh vkns'k Øekad↓"]
[2001]
["Lohd`rh vkns'k fnukad↓"]
["2024-07-15"]
["Ø- la-","uke deZpkjh","in uke","inLFkkiu LFkku",{"$f":"\"30-06-\"&A4&\" dks izkIr osru\"","v":"30-06-2024 dks izkIr osru"},null,"osru o`f) fnukad","fo'ks\"k fooj.k"]
[{"$nulls":4},"is&ysoy","osru"]
[1,"izeksn dqekj lSuh","v/;kid","jkmekfo ekywrkuk",{"v":11,"d":",y & 11"},50800,"2025-01-01"]
[2]
[3]
[4]
[5]
[6]
[7]
[8,"izeksn dqekj lSuh","v/;kid","jkmekfo ekywrkuk",{"v":11,"d":",y & 11"},49300,"2024-07-01"]
[9]
[10]
[11]
[12]
[13]
[14]
[15]
[16]
[17]
[18]
[19]
[20]
[21]
[22]
[23]
[24]
[25]
[26]
[27]
[28]
[29]
[30]
[31]
[32]
[33]
[34]
[35]
[36]
[37]
[38]
[39]
[40]
[41]
[42]
[43]
[44]
[45]
[46]
[47]
[48]
[49]
[50]

{"sheet":"Sheet3","index":2,"n_rows":69,"n_cols":8,"rows_kept":69,"merged":[[0,0,0,7],[2,0,2,7],[3,0,3,7],[4,0,4,7],[5,0,6,0],[5,1,6,1],[5,2,5,3],[5,4,6,4],[5,5,6,5],[5,6,6,6],[5,7,6,7],[58,0,58,7],[59,0,59,7],[61,5,61,7],[68,5,68,7]]}
[{"$f":"\"dk;kZy; \"&Sheet2!A2","v":"dk;kZy; iz/kkukpk;Z de ihbZbZvks] jktdh; mPp ek/;fed fon~;ky; ekywrkuk ¼Fkkukxkth½ vyoj"}]
[{"$f":"\"dzekad % \"&Sheet2!A6","v":"dzekad % 2001"},{"$nulls":6},{"$f":"\"fnukad % \"&TEXT(Sheet2!A8,\"DD-MM-YYYY\")","v":"fnukad % 15-07-2024"}]
["% lkef;d osru o`f) vkns'k %"]
[]
["     jkT; ljdkj ds foÙk foHkkx ds vkns'k dzekad ,Q-15¼1½,QMh¼#Yl½@2017 t;iqj fnukad 30-10-2017 o f}rh; la'kks/ku fnukad 09-12-2017 ds izko/kkuksa ds vuqlj.k esa bl dk;kZy; ds v/khu dk;Zjr fuEukafdr LFkkbZ deZpkfj;ksa dks muds }kjk ,d o\"kZ dh larks\"ktud lsok iw.kZ djus ij muds uke ds laeq[k vafdr dkWye 5 dh fnukad ls okf\"kZd osru o`f) dkWye la[;ka 6 ds vuqlkj Lohd`r dh tkdj rn~ vuqlkj osru ,oa HkÙks vkgfjr fd;s tkus dh Lohd`rh iznku dh tkrh gSA\n"]
["Ø- \nla-","uke deZpkjh] in uke ,oa inLFkkiu LFkku",{"$f":"Sheet2!E9","v":"30-06-2024 dks izkIr osru"},null,"osru o`f) fnukad","osru o`f) Ik'pkr~ osru","vkxkeh osru o`f) fnukad","fo'ks\"k fooj.k"]
[null,null,"is&ysoy","ewy osru"]
[1,2,3,4,5,6,7,8]
[{"$f":"IF(OR(OR(OR(B9=\"\",C9=\"\",D9=\"\",E9=\"\"))),\"\",1)","v":1},{"$f":"Sheet2!B11&\"] \"&Sheet2!C11&\"] \"&Sheet2!D11","v":"izeksn dqekj lSuh] v/;kid] jkmekfo ekywrkuk"},{"$f":"IF(Sheet2!E11=\"\",\"\",Sheet2!E11)","v":{"v":11,"d":",y & 11"}},{"$f":"IF(Sheet2!F11=\"\",\"\",Sheet2!F11)","v":50800},{"$f":"IF(Sheet2!G11=\"\",\"\",TEXT(Sheet2!G11,\"D-M-YYYY\"))","v":"1-1-2025"},{"$f":"IFERROR(MROUND(D9*103%,100),\"\")","v":52300},{"$f":"IFERROR(\"1-\"&MONTH(E9)&\"-\"&YEAR(E9)+1,\"\")","v":"1-1-2026"},{"$f":"IF(Sheet2!H11=\"\",\"\",Sheet2!H11)","v":""}]
[{"$f":"IF(OR(OR(OR(B10=\"\",C10=\"\",D10=\"\",E10=\"\"))),\"\",MAX($A$9:A9)+1)","v":""},{"$f":"Sheet2!B12&\"] \"&Sheet2!C12&\"] \"&Sheet2!D12","v":"] ] "},{"$f":"IF(Sheet2!E12=\"\",\"\",Sheet2!E12)","v":""},{"$f":"IF(Sheet2!F12=\"\",\"\",Sheet2!F12)","v":""},{"$f":"IF(Sheet2!G12=\"\",\"\",TEXT(Sheet2!G12,\"D-M-YYYY\"))","v":""},{"$f":"IFERROR(MROUND(D10*103%,100),\"\")","v":""},{"$f":"IFERROR(\"1-\"&MONTH(E10)&\"-\"&YEAR(E10)+1,\"\")","v":""},{"$f":"IF(Sheet2!H12=\"\",\"\",Sheet2!H12)","v":""}]
[{"$f":"IF(OR(OR(OR(B11=\"\",C11=\"\",D11=\"\",E11=\"\"))),\"\",MAX($A$9:A10)+1)","v":""},{"$f":"Sheet2!B13&\"] \"&Sheet2!C13&\"] \"&Sheet2!D13","v":"] ] "},{"$f":"IF(Sheet2!E13=\"\",\"\",Sheet2!E13)","v":""},{"$f":"IF(Sheet2!F13=\"\",\"\",Sheet2!F13)","v":""},{"$f":"IF(Sheet2!G13=\"\",\"\",TEXT(Sheet2!G13,\"D-M-YYYY\"))","v":""},"","",{"$f":"IF(Sheet2!H13=\"\",\"\",Sheet2!H13)","v":""}]
[{"$f":"IF(OR(OR(OR(B12=\"\",C12=\"\",D12=\"\",E12=\"\"))),\"\",MAX($A$9:A11)+1)","v":""},{"$f":"Sheet2!B14&\"] \"&Sheet2!C14&\"] \"&Sheet2!D14","v":"] ] "},{"$f":"IF(Sheet2!E14=\"\",\"\",Sheet2!E14)","v":""},{"$f":"IF(Sheet2!F14=\"\",\"\",Sheet2!F14)","v":""},{"$f":"IF(Sheet2!G14=\"\",\"\",TEXT(Sheet2!G14,\"D-M-YYYY\"))","v":""},"","",{"$f":"IF(Sheet2!H14=\"\",\"\",Sheet2!H14)","v":""}]
[{"$f":"IF(OR(OR(OR(B13=\"\",C13=\"\",D13=\"\",E13=\"\"))),\"\",MAX($A$9:A12)+1)","v":""},{"$f":"Sheet2!B15&\"] \"&Sheet2!C15&\"] \"&Sheet2!D15","v":"] ] "},{"$f":"IF(Sheet2!E15=\"\",\"\",Sheet2!E15)","v":""},{"$f":"IF(Sheet2!F15=\"\",\"\",Sheet2!F15)","v":""},{"$f":"IF(Sheet2!G15=\"\",\"\",TEXT(Sheet2!G15,\"D-M-YYYY\"))","v":""},"","",{"$f":"IF(Sheet2!H15=\"\",\"\",Sheet2!H15)","v":""}]
[{"$f":"IF(OR(OR(OR(B14=\"\",C14=\"\",D14=\"\",E14=\"\"))),\"\",MAX($A$9:A13)+1)","v":""},{"$f":"Sheet2!B16&\"] \"&Sheet2!C16&\"] \"&Sheet2!D16","v":"] ] "},{"$f":"IF(Sheet2!E16=\"\",\"\",Sheet2!E16)","v":""},{"$f":"IF(Sheet2!F16=\"\",\"\",Sheet2!F16)","v":""},{"$f":"IF(Sheet2!G16=\"\",\"\",TEXT(Sheet2!G16,\"D-M-YYYY\"))","v":""},"","",{"$f":"IF(Sheet2!H16=\"\",\"\",Sheet2!H16)","v":""}]
[{"$f":"IF(OR(OR(OR(B15=\"\",C15=\"\",D15=\"\",E15=\"\"))),\"\",MAX($A$9:A14)+1)","v":""},{"$f":"Sheet2!B17&\"] \"&Sheet2!C17&\"] \"&Sheet2!D17","v":"] ] "},{"$f":"IF(Sheet2!E17=\"\",\"\",Sheet2!E17)","v":""},{"$f":"IF(Sheet2!F17=\"\",\"\",Sheet2!F17)","v":""},{"$f":"IF(Sheet2!G17=\"\",\"\",TEXT(Sheet2!G17,\"D-M-YYYY\"))","v":""},"","",{"$f":"IF(Sheet2!H17=\"\",\"\",Sheet2!H17)","v":""}]
[{"$f":"IF(OR(OR(OR(B16=\"\",C16=\"\",D16=\"\",E16=\"\"))),\"\",MAX($A$9:A15)+1)","v":2},{"$f":"Sheet2!B18&\"] \"&Sheet2!C18&\"] \"&Sheet2!D18","v":"izeksn dqekj lSuh] v/;kid] jkmekfo ekywrkuk"},{"$f":"IF(Sheet2!E18=\"\",\"\",Sheet2!E18)","v":{"v":11,"d":",y & 11"}},{"$f":"IF(Sheet2!F18=\"\",\"\",Sheet2!F18)","v":49300},{"$f":"IF(Sheet2!G18=\"\",\"\",TEXT(Sheet2!G18,\"D-M-YYYY\"))","v":"1-7-2024"},50800,{"$f":"IFERROR(\"1-\"&MONTH(E16)&\"-\"&YEAR(E16)+1,\"\")","v":"1-7-2025"},{"$f":"IF(Sheet2!H18=\"\",\"\",Sheet2!H18)","v":""}]
[{"$f":"IF(OR(OR(OR(B17=\"\",C17=\"\",D17=\"\",E17=\"\"))),\"\",MAX($A$9:A16)+1)","v":""},{"$f":"Sheet2!B19&\"] \"&Sheet2!C19&\"] \"&Sheet2!D19","v":"] ] "},{"$f":"IF(Sheet2!E19=\"\",\"\",Sheet2!E19)","v":""},{"$f":"IF(Sheet2!F19=\"\",\"\",Sheet2!F19)","v":""},{"$f":"IF(Sheet2!G19=\"\",\"\",TEXT(Sheet2!G19,\"D-M-YYYY\"))","v":""},"","",{"$f":"IF(Sheet2!H19=\"\",\"\",Sheet2!H19)","v":""}]
[{"$f":"IF(OR(OR(OR(B18=\"\",C18=\"\",D18=\"\",E18=\"\"))),\"\",MAX($A$9:A17)+1)","v":""},{"$f":"Sheet2!B20&\"] \"&Sheet2!C20&\"] \"&Sheet2!D20","v":"] ] "},{"$f":"IF(Sheet2!E20=\"\",\"\",Sheet2!E20)","v":""},{"$f":"IF(Sheet2!F20=\"\",\"\",Sheet2!F20)","v":""},{"$f":"IF(Sheet2!G20=\"\",\"\",TEXT(Sheet2!G20,\"D-M-YYYY\"))","v":""},"","",{"$f":"IF(Sheet2!H20=\"\",\"\",Sheet2!H20)","v":""}]
[{"$f":"IF(OR(OR(OR(B19=\"\",C19=\"\",D19=\"\",E19=\"\"))),\"\",MAX($A$9:A18)+1)","v":""},{"$f":"Sheet2!B21&\"] \"&Sheet2!C21&\"] \"&Sheet2!D21","v":"] ] "},{"$f":"IF(Sheet2!E21=\"\",\"\",Sheet2!E21)","v":""},{"$f":"IF(Sheet2!F21=\"\",\"\",Sheet2!F21)","v":""},{"$f":"IF(Sheet2!G21=\"\",\"\",TEXT(Sheet2!G21,\"D-M-YYYY\"))","v":""},"","",{"$f":"IF(Sheet2!H21=\"\",\"\",Sheet2!H21)","v":""}]
[{"$f":"IF(OR(OR(OR(B20=\"\",C20=\"\",D20=\"\",E20=\"\"))),\"\",MAX($A$9:A19)+1)","v":""},{"$f":"Sheet2!B22&\"] \"&Sheet2!C22&\"] \"&Sheet2!D22","v":"] ] "},{"$f":"IF(Sheet2!E22=\"\",\"\",Sheet2!E22)","v":""},{"$f":"IF(Sheet2!F22=\"\",\"\",Sheet2!F22)","v":""},{"$f":"IF(Sheet2!G22=\"\",\"\",TEXT(Sheet2!G22,\"D-M-YYYY\"))","v":""},"","",{"$f":"IF(Sheet2!H22=\"\",\"\",Sheet2!H22)","v":""}]
[{"$f":"IF(OR(OR(OR(B21=\"\",C21=\"\",D21=\"\",E21=\"\"))),\"\",MAX($A$9:A20)+1)","v":""},{"$f":"Sheet2!B23&\"] \"&Sheet2!C23&\"] \"&Sheet2!D23","v":"] ] "},{"$f":"IF(Sheet2!E23=\"\",\"\",Sheet2!E23)","v":""},{"$f":"IF(Sheet2!F23=\"\",\"\",Sheet2!F23)","v":""},{"$f":"IF(Sheet2!G23=\"\",\"\",TEXT(Sheet2!G23,\"D-M-YYYY\"))","v":""},"","",{"$f":"IF(Sheet2!H23=\"\",\"\",Sheet2!H23)","v":""}]
[{"$f":"IF(OR(OR(OR(B22=\"\",C22=\"\",D22=\"\",E22=\"\"))),\"\",MAX($A$9:A21)+1)","v":""},{"$f":"Sheet2!B24&\"] \"&Sheet2!C24&\"] \"&Sheet2!D24","v":"] ] "},{"$f":"IF(Sheet2!E24=\"\",\"\",Sheet2!E24)","v":""},{"$f":"IF(Sheet2!F24=\"\",\"\",Sheet2!F24)","v":""},{"$f":"IF(Sheet2!G24=\"\",\"\",TEXT(Sheet2!G24,\"D-M-YYYY\"))","v":""},"","",{"$f":"IF(Sheet2!H24=\"\",\"\",Sheet2!H24)","v":""}]
[{"$f":"IF(OR(OR(OR(B23=\"\",C23=\"\",D23=\"\",E23=\"\"))),\"\",MAX($A$9:A22)+1)","v":""},{"$f":"Sheet2!B25&\"] \"&Sheet2!C25&\"] \"&Sheet2!D25","v":"] ] "},{"$f":"IF(Sheet2!E25=\"\",\"\",Sheet2!E25)","v":""},{"$f":"IF(Sheet2!F25=\"\",\"\",Sheet2!F25)","v":""},{"$f":"IF(Sheet2!G25=\"\",\"\",TEXT(Sheet2!G25,\"D-M-YYYY\"))","v":""},"","",{"$f":"IF(Sheet2!H25=\"\",\"\",Sheet2!H25)","v":""}]
[{"$f":"IF(OR(OR(OR(B24=\"\",C24=\"\",D24=\"\",E24=\"\"))),\"\",MAX($A$9:A23)+1)","v":""},{"$f":"Sheet2!B26&\"] \"&Sheet2!C26&\"] \"&Sheet2!D26","v":"] ] "},{"$f":"IF(Sheet2!E26=\"\",\"\",Sheet2!E26)","v":""},{"$f":"IF(Sheet2!F26=\"\",\"\",Sheet2!F26)","v":""},{"$f":"IF(Sheet2!G26=\"\",\"\",TEXT(Sheet2!G26,\"D-M-YYYY\"))","v":""},"","",{"$f":"IF(Sheet2!H26=\"\",\"\",Sheet2!H26)","v":""}]
[{"$f":"IF(OR(OR(OR(B25=\"\",C25=\"\",D25=\"\",E25=\"\"))),\"\",MAX($A$9:A24)+1)","v":""},{"$f":"Sheet2!B27&\"] \"&Sheet2!C27&\"] \"&Sheet2!D27","v":"] ] "},{"$f":"IF(Sheet2!E27=\"\",\"\",Sheet2!E27)","v":""},{"$f":"IF(Sheet2!F27=\"\",\"\",Sheet2!F27)","v":""},{"$f":"IF(Sheet2!G27=\"\",\"\",TEXT(Sheet2!G27,\"D-M-YYYY\"))","v":""},"","",{"$f":"IF(Sheet2!H27=\"\",\"\",Sheet2!H27)","v":""}]
[{"$f":"IF(OR(OR(OR(B26=\"\",C26=\"\",D26=\"\",E26=\"\"))),\"\",MAX($A$9:A25)+1)","v":""},{"$f":"Sheet2!B28&\"] \"&Sheet2!C28&\"] \"&Sheet2!D28","v":"] ] "},{"$f":"IF(Sheet2!E28=\"\",\"\",Sheet2!E28)","v":""},{"$f":"IF(Sheet2!F28=\"\",\"\",Sheet2!F28)","v":""},{"$f":"IF(Sheet2!G28=\"\",\"\",TEXT(Sheet2!G28,\"D-M-YYYY\"))","v":""},"","",{"$f":"IF(Sheet2!H28=\"\",\"\",Sheet2!H28)","v":""}]
[{"$f":"IF(OR(OR(OR(B27=\"\",C27=\"\",D27=\"\",E27=\"\"))),\"\",MAX($A$9:A26)+1)","v":""},{"$f":"Sheet2!B29&\"] \"&Sheet2!C29&\"] \"&Sheet2!D29","v":"] ] "},{"$f":"IF(Sheet2!E29=\"\",\"\",Sheet2!E29)","v":""},{"$f":"IF(Sheet2!F29=\"\",\"\",Sheet2!F29)","v":""},{"$f":"IF(Sheet2!G29=\"\",\"\",TEXT(Sheet2!G29,\"D-M-YYYY\"))","v":""},"","",{"$f":"IF(Sheet2!H29=\"\",\"\",Sheet2!H29)","v":""}]
[{"$f":"IF(OR(OR(OR(B28=\"\",C28=\"\",D28=\"\",E28=\"\"))),\"\",MAX($A$9:A27)+1)","v":""},{"$f":"Sheet2!B30&\"] \"&Sheet2!C30&\"] \"&Sheet2!D30","v":"] ] "},{"$f":"IF(Sheet2!E30=\"\",\"\",Sheet2!E30)","v":""},{"$f":"IF(Sheet2!F30=\"\",\"\",Sheet2!F30)","v":""},{"$f":"IF(Sheet2!G30=\"\",\"\",TEXT(Sheet2!G30,\"D-M-YYYY\"))","v":""},"","",{"$f":"IF(Sheet2!H30=\"\",\"\",Sheet2!H30)","v":""}]
[{"$f":"IF(OR(OR(OR(B29=\"\",C29=\"\",D29=\"\",E29=\"\"))),\"\",MAX($A$9:A28)+1)","v":""},{"$f":"Sheet2!B31&\"] \"&Sheet2!C31&\"] \"&Sheet2!D31","v":"] ] "},{"$f":"IF(Sheet2!E31=\"\",\"\",Sheet2!E31)","v":""},{"$f":"IF(Sheet2!F31=\"\",\"\",Sheet2!F31)","v":""},{"$f":"IF(Sheet2!G31=\"\",\"\",TEXT(Sheet2!G31,\"D-M-YYYY\"))","v":""},"","",{"$f":"IF(Sheet2!H31=\"\",\"\",Sheet2!H31)","v":""}]
[{"$f":"IF(OR(OR(OR(B30=\"\",C30=\"\",D30=\"\",E30=\"\"))),\"\",MAX($A$9:A29)+1)","v":""},{"$f":"Sheet2!B32&\"] \"&Sheet2!C32&\"] \"&Sheet2!D32","v":"] ] "},{"$f":"IF(Sheet2!E32=\"\",\"\",Sheet2!E32)","v":""},{"$f":"IF(Sheet2!F32=\"\",\"\",Sheet2!F32)","v":""},{"$f":"IF(Sheet2!G32=\"\",\"\",TEXT(Sheet2!G32,\"D-M-YYYY\"))","v":""},"","",{"$f":"IF(Sheet2!H32=\"\",\"\",Sheet2!H32)","v":""}]
[{"$f":"IF(OR(OR(OR(B31=\"\",C31=\"\",D31=\"\",E31=\"\"))),\"\",MAX($A$9:A30)+1)","v":""},{"$f":"Sheet2!B33&\"] \"&Sheet2!C33&\"] \"&Sheet2!D33","v":"] ] "},{"$f":"IF(Sheet2!E33=\"\",\"\",Sheet2!E33)","v":""},{"$f":"IF(Sheet2!F33=\"\",\"\",Sheet2!F33)","v":""},{"$f":"IF(Sheet2!G33=\"\",\"\",TEXT(Sheet2!G33,\"D-M-YYYY\"))","v":""},"","",{"$f":"IF(Sheet2!H33=\"\",\"\",Sheet2!H33)","v":""}]
[{"$f":"IF(OR(OR(OR(B32=\"\",C32=\"\",D32=\"\",E32=\"\"))),\"\",MAX($A$9:A31)+1)","v":""},{"$f":"Sheet2!B34&\"] \"&Sheet2!C34&\"] \"&Sheet2!D34","v":"] ] "},{"$f":"IF(Sheet2!E34=\"\",\"\",Sheet2!E34)","v":""},{"$f":"IF(Sheet2!F34=\"\",\"\",Sheet2!F34)","v":""},{"$f":"IF(Sheet2!G34=\"\",\"\",TEXT(Sheet2!G34,\"D-M-YYYY\"))","v":""},"","",{"$f":"IF(Sheet2!H34=\"\",\"\",Sheet2!H34)","v":""}]
[{"$f":"IF(OR(OR(OR(B33=\"\",C33=\"\",D33=\"\",E33=\"\"))),\"\",MAX($A$9:A32)+1)","v":""},{"$f":"Sheet2!B35&\"] \"&Sheet2!C35&\"] \"&Sheet2!D35","v":"] ] "},{"$f":"IF(Sheet2!E35=\"\",\"\",Sheet2!E35)","v":""},{"$f":"IF(Sheet2!F35=\"\",\"\",Sheet2!F35)","v":""},{"$f":"IF(Sheet2!G35=\"\",\"\",TEXT(Sheet2!G35,\"D-M-YYYY\"))","v":""},"","",{"$f":"IF(Sheet2!H35=\"\",\"\",Sheet2!H35)","v":""}]
[{"$f":"IF(OR(OR(OR(B34=\"\",C34=\"\",D34=\"\",E34=\"\"))),\"\",MAX($A$9:A33)+1)","v":""},{"$f":"Sheet2!B36&\"] \"&Sheet2!C36&\"] \"&Sheet2!D36","v":"] ] "},{"$f":"IF(Sheet2!E36=\"\",\"\",Sheet2!E36)","v":""},{"$f":"IF(Sheet2!F36=\"\",\"\",Sheet2!F36)","v":""},{"$f":"IF(Sheet2!G36=\"\",\"\",TEXT(Sheet2!G36,\"D-M-YYYY\"))","v":""},"","",{"$f":"IF(Sheet2!H36=\"\",\"\",Sheet2!H36)","v":""}]
[{"$f":"IF(OR(OR(OR(B35=\"\",C35=\"\",D35=\"\",E35=\"\"))),\"\",MAX($A$9:A34)+1)","v":""},{"$f":"Sheet2!B37&\"] \"&Sheet2!C37&\"] \"&Sheet2!D37","v":"] ] "},{"$f":"IF(Sheet2!E37=\"\",\"\",Sheet2!E37)","v":""},{"$f":"IF(Sheet2!F37=\"\",\"\",Sheet2!F37)","v":""},{"$f":"IF(Sheet2!G37=\"\",\"\",TEXT(Sheet2!G37,\"D-M-YYYY\"))","v":""},"","",{"$f":"IF(Sheet2!H37=\"\",\"\",Sheet2!H37)","v":""}]
[{"$f":"IF(OR(OR(OR(B36=\"\",C36=\"\",D36=\"\",E36=\"\"))),\"\",MAX($A$9:A35)+1)","v":""},{"$f":"Sheet2!B38&\"] \"&Sheet2!C38&\"] \"&Sheet2!D38","v":"] ] "},{"$f":"IF(Sheet2!E38=\"\",\"\",Sheet2!E38)","v":""},{"$f":"IF(Sheet2!F38=\"\",\"\",Sheet2!F38)","v":""},{"$f":"IF(Sheet2!G38=\"\",\"\",TEXT(Sheet2!G38,\"D-M-YYYY\"))","v":""},"","",{"$f":"IF(Sheet2!H38=\"\",\"\",Sheet2!H38)","v":""}]
[{"$f":"IF(OR(OR(OR(B37=\"\",C37=\"\",D37=\"\",E37=\"\"))),\"\",MAX($A$9:A36)+1)","v":""},{"$f":"Sheet2!B39&\"] \"&Sheet2!C39&\"] \"&Sheet2!D39","v":"] ] "},{"$f":"IF(Sheet2!E39=\"\",\"\",Sheet2!E39)","v":""},{"$f":"IF(Sheet2!F39=\"\",\"\",Sheet2!F39)","v":""},{"$f":"IF(Sheet2!G39=\"\",\"\",TEXT(Sheet2!G39,\"D-M-YYYY\"))","v":""},"","",{"$f":"IF(Sheet2!H39=\"\",\"\",Sheet2!H39)","v":""}]
[{"$f":"IF(OR(OR(OR(B38=\"\",C38=\"\",D38=\"\",E38=\"\"))),\"\",MAX($A$9:A37)+1)","v":""},{"$f":"Sheet2!B40&\"] \"&Sheet2!C40&\"] \"&Sheet2!D40","v":"] ] "},{"$f":"IF(Sheet2!E40=\"\",\"\",Sheet2!E40)","v":""},{"$f":"IF(Sheet2!F40=\"\",\"\",Sheet2!F40)","v":""},{"$f":"IF(Sheet2!G40=\"\",\"\",TEXT(Sheet2!G40,\"D-M-YYYY\"))","v":""},"","",{"$f":"IF(Sheet2!H40=\"\",\"\",Sheet2!H40)","v":""}]
[{"$f":"IF(OR(OR(OR(B39=\"\",C39=\"\",D39=\"\",E39=\"\"))),\"\",MAX($A$9:A38)+1)","v":""},{"$f":"Sheet2!B41&\"] \"&Sheet2!C41&\"] \"&Sheet2!D41","v":"] ] "},{"$f":"IF(Sheet2!E41=\"\",\"\",Sheet2!E41)","v":""},{"$f":"IF(Sheet2!F41=\"\",\"\",Sheet2!F41)","v":""},{"$f":"IF(Sheet2!G41=\"\",\"\",TEXT(Sheet2!G41,\"D-M-YYYY\"))","v":""},"","",{"$f":"IF(Sheet2!H41=\"\",\"\",Sheet2!H41)","v":""}]
[{"$f":"IF(OR(OR(OR(B40=\"\",C40=\"\",D40=\"\",E40=\"\"))),\"\",MAX($A$9:A39)+1)","v":""},{"$f":"Sheet2!B42&\"] \"&Sheet2!C42&\"] \"&Sheet2!D42","v":"] ] "},{"$f":"IF(Sheet2!E42=\"\",\"\",Sheet2!E42)","v":""},{"$f":"IF(Sheet2!F42=\"\",\"\",Sheet2!F42)","v":""},{"$f":"IF(Sheet2!G42=\"\",\"\",TEXT(Sheet2!G42,\"D-M-YYYY\"))","v":""},"","",{"$f":"IF(Sheet2!H42=\"\",\"\",Sheet2!H42)","v":""}]
[{"$f":"IF(OR(OR(OR(B41=\"\",C41=\"\",D41=\"\",E41=\"\"))),\"\",MAX($A$9:A40)+1)","v":""},{"$f":"Sheet2!B43&\"] \"&Sheet2!C43&\"] \"&Sheet2!D43","v":"] ] "},{"$f":"IF(Sheet2!E43=\"\",\"\",Sheet2!E43)","v":""},{"$f":"IF(Sheet2!F43=\"\",\"\",Sheet2!F43)","v":""},{"$f":"IF(Sheet2!G43=\"\",\"\",TEXT(Sheet2!G43,\"D-M-YYYY\"))","v":""},"","",{"$f":"IF(Sheet2!H43=\"\",\"\",Sheet2!H43)","v":""}]
[{"$f":"IF(OR(OR(OR(B42=\"\",C42=\"\",D42=\"\",E42=\"\"))),\"\",MAX($A$9:A41)+1)","v":""},{"$f":"Sheet2!B44&\"] \"&Sheet2!C44&\"] \"&Sheet2!D44","v":"] ] "},{"$f":"IF(Sheet2!E44=\"\",\"\",Sheet2!E44)","v":""},{"$f":"IF(Sheet2!F44=\"\",\"\",Sheet2!F44)","v":""},{"$f":"IF(Sheet2!G44=\"\",\"\",TEXT(Sheet2!G44,\"D-M-YYYY\"))","v":""},"","",{"$f":"IF(Sheet2!H44=\"\",\"\",Sheet2!H44)","v":""}]
[{"$f":"IF(OR(OR(OR(B43=\"\",C43=\"\",D43=\"\",E43=\"\"))),\"\",MAX($A$9:A42)+1)","v":""},{"$f":"Sheet2!B45&\"] \"&Sheet2!C45&\"] \"&Sheet2!D45","v":"] ] "},{"$f":"IF(Sheet2!E45=\"\",\"\",Sheet2!E45)","v":""},{"$f":"IF(Sheet2!F45=\"\",\"\",Sheet2!F45)","v":""},{"$f":"IF(Sheet2!G45=\"\",\"\",TEXT(Sheet2!G45,\"D-M-YYYY\"))","v":""},"","",{"$f":"IF(Sheet2!H45=\"\",\"\",Sheet2!H45)","v":""}]
[{"$f":"IF(OR(OR(OR(B44=\"\",C44=\"\",D44=\"\",E44=\"\"))),\"\",MAX($A$9:A43)+1)","v":""},{"$f":"Sheet2!B46&\"] \"&Sheet2!C46&\"] \"&Sheet2!D46","v":"] ] "},{"$f":"IF(Sheet2!E46=\"\",\"\",Sheet2!E46)","v":""},{"$f":"IF(Sheet2!F46=\"\",\"\",Sheet2!F46)","v":""},{"$f":"IF(Sheet2!G46=\"\",\"\",TEXT(Sheet2!G46,\"D-M-YYYY\"))","v":""},"","",{"$f":"IF(Sheet2!H46=\"\",\"\",Sheet2!H46)","v":""}]
[{"$f":"IF(OR(OR(OR(B45=\"\",C45=\"\",D45=\"\",E45=\"\"))),\"\",MAX($A$9:A44)+1)","v":""},{"$f":"Sheet2!B47&\"] \"&Sheet2!C47&\"] \"&Sheet2!D47","v":"] ] "},{"$f":"IF(Sheet2!E47=\"\",\"\",Sheet2!E47)","v":""},{"$f":"IF(Sheet2!F47=\"\",\"\",Sheet2!F47)","v":""},{"$f":"IF(Sheet2!G47=\"\",\"\",TEXT(Sheet2!G47,\"D-M-YYYY\"))","v":""},"","",{"$f":"IF(Sheet2!H47=\"\",\"\",Sheet2!H47)","v":""}]
[{"$f":"IF(OR(OR(OR(B46=\"\",C46=\"\",D46=\"\",E46=\"\"))),\"\",MAX($A$9:A45)+1)","v":""},{"$f":"Sheet2!B48&\"] \"&Sheet2!C48&\"] \"&Sheet2!D48","v":"] ] "},{"$f":"IF(Sheet2!E48=\"\",\"\",Sheet2!E48)","v":""},{"$f":"IF(Sheet2!F48=\"\",\"\",Sheet2!F48)","v":""},{"$f":"IF(Sheet2!G48=\"\",\"\",TEXT(Sheet2!G48,\"D-M-YYYY\"))","v":""},"","",{"$f":"IF(Sheet2!H48=\"\",\"\",Sheet2!H48)","v":""}]
[{"$f":"IF(OR(OR(OR(B47=\"\",C47=\"\",D47=\"\",E47=\"\"))),\"\",MAX($A$9:A46)+1)","v":""},{"$f":"Sheet2!B49&\"] \"&Sheet2!C49&\"] \"&Sheet2!D49","v":"] ] "},{"$f":"IF(Sheet2!E49=\"\",\"\",Sheet2!E49)","v":""},{"$f":"IF(Sheet2!F49=\"\",\"\",Sheet2!F49)","v":""},{"$f":"IF(Sheet2!G49=\"\",\"\",TEXT(Sheet2!G49,\"D-M-YYYY\"))","v":""},"","",{"$f":"IF(Sheet2!H49=\"\",\"\",Sheet2!H49)","v":""}]
[{"$f":"IF(OR(OR(OR(B48=\"\",C48=\"\",D48=\"\",E48=\"\"))),\"\",MAX($A$9:A47)+1)","v":""},{"$f":"Sheet2!B50&\"] \"&Sheet2!C50&\"] \"&Sheet2!D50","v":"] ] "},{"$f":"IF(Sheet2!E50=\"\",\"\",Sheet2!E50)","v":""},{"$f":"IF(Sheet2!F50=\"\",\"\",Sheet2!F50)","v":""},{"$f":"IF(Sheet2!G50=\"\",\"\",TEXT(Sheet2!G50,\"D-M-YYYY\"))","v":""},"","",{"$f":"IF(Sheet2!H50=\"\",\"\",Sheet2!H50)","v":""}]
[{"$f":"IF(OR(OR(OR(B49=\"\",C49=\"\",D49=\"\",E49=\"\"))),\"\",MAX($A$9:A48)+1)","v":""},{"$f":"Sheet2!B51&\"] \"&Sheet2!C51&\"] \"&Sheet2!D51","v":"] ] "},{"$f":"IF(Sheet2!E51=\"\",\"\",Sheet2!E51)","v":""},{"$f":"IF(Sheet2!F51=\"\",\"\",Sheet2!F51)","v":""},{"$f":"IF(Sheet2!G51=\"\",\"\",TEXT(Sheet2!G51,\"D-M-YYYY\"))","v":""},"","",{"$f":"IF(Sheet2!H51=\"\",\"\",Sheet2!H51)","v":""}]
[{"$f":"IF(OR(OR(OR(B50=\"\",C50=\"\",D50=\"\",E50=\"\"))),\"\",MAX($A$9:A49)+1)","v":""},{"$f":"Sheet2!B52&\"] \"&Sheet2!C52&\"] \"&Sheet2!D52","v":"] ] "},{"$f":"IF(Sheet2!E52=\"\",\"\",Sheet2!E52)","v":""},{"$f":"IF(Sheet2!F52=\"\",\"\",Sheet2!F52)","v":""},{"$f":"IF(Sheet2!G52=\"\",\"\",TEXT(Sheet2!G52,\"D-M-YYYY\"))","v":""},"","",{"$f":"IF(Sheet2!H52=\"\",\"\",Sheet2!H52)","v":""}]
[{"$f":"IF(OR(OR(OR(B51=\"\",C51=\"\",D51=\"\",E51=\"\"))),\"\",MAX($A$9:A50)+1)","v":""},{"$f":"Sheet2!B53&\"] \"&Sheet2!C53&\"] \"&Sheet2!D53","v":"] ] "},{"$f":"IF(Sheet2!E53=\"\",\"\",Sheet2!E53)","v":""},{"$f":"IF(Sheet2!F53=\"\",\"\",Sheet2!F53)","v":""},{"$f":"IF(Sheet2!G53=\"\",\"\",TEXT(Sheet2!G53,\"D-M-YYYY\"))","v":""},"","",{"$f":"IF(Sheet2!H53=\"\",\"\",Sheet2!H53)","v":""}]
[{"$f":"IF(OR(OR(OR(B52=\"\",C52=\"\",D52=\"\",E52=\"\"))),\"\",MAX($A$9:A51)+1)","v":""},{"$f":"Sheet2!B54&\"] \"&Sheet2!C54&\"] \"&Sheet2!D54","v":"] ] "},{"$f":"IF(Sheet2!E54=\"\",\"\",Sheet2!E54)","v":""},{"$f":"IF(Sheet2!F54=\"\",\"\",Sheet2!F54)","v":""},{"$f":"IF(Sheet2!G54=\"\",\"\",TEXT(Sheet2!G54,\"D-M-YYYY\"))","v":""},"","",{"$f":"IF(Sheet2!H54=\"\",\"\",Sheet2!H54)","v":""}]
[{"$f":"IF(OR(OR(OR(B53=\"\",C53=\"\",D53=\"\",E53=\"\"))),\"\",MAX($A$9:A52)+1)","v":""},{"$f":"Sheet2!B55&\"] \"&Sheet2!C55&\"] \"&Sheet2!D55","v":"] ] "},{"$f":"IF(Sheet2!E55=\"\",\"\",Sheet2!E55)","v":""},{"$f":"IF(Sheet2!F55=\"\",\"\",Sheet2!F55)","v":""},{"$f":"IF(Sheet2!G55=\"\",\"\",TEXT(Sheet2!G55,\"D-M-YYYY\"))","v":""},"","",{"$f":"IF(Sheet2!H55=\"\",\"\",Sheet2!H55)","v":""}]
[{"$f":"IF(OR(OR(OR(B54=\"\",C54=\"\",D54=\"\",E54=\"\"))),\"\",MAX($A$9:A53)+1)","v":""},{"$f":"Sheet2!B56&\"] \"&Sheet2!C56&\"] \"&Sheet2!D56","v":"] ] "},{"$f":"IF(Sheet2!E56=\"\",\"\",Sheet2!E56)","v":""},{"$f":"IF(Sheet2!F56=\"\",\"\",Sheet2!F56)","v":""},{"$f":"IF(Sheet2!G56=\"\",\"\",TEXT(Sheet2!G56,\"D-M-YYYY\"))","v":""},"","",{"$f":"IF(Sheet2!H56=\"\",\"\",Sheet2!H56)","v":""}]
[{"$f":"IF(OR(OR(OR(B55=\"\",C55=\"\",D55=\"\",E55=\"\"))),\"\",MAX($A$9:A54)+1)","v":""},{"$f":"Sheet2!B57&\"] \"&Sheet2!C57&\"] \"&Sheet2!D57","v":"] ] "},{"$f":"IF(Sheet2!E57=\"\",\"\",Sheet2!E57)","v":""},{"$f":"IF(Sheet2!F57=\"\",\"\",Sheet2!F57)","v":""},{"$f":"IF(Sheet2!G57=\"\",\"\",TEXT(Sheet2!G57,\"D-M-YYYY\"))","v":""},"","",{"$f":"IF(Sheet2!H57=\"\",\"\",Sheet2!H57)","v":""}]
[{"$f":"IF(OR(OR(OR(B56=\"\",C56=\"\",D56=\"\",E56=\"\"))),\"\",MAX($A$9:A55)+1)","v":""},{"$f":"Sheet2!B58&\"] \"&Sheet2!C58&\"] \"&Sheet2!D58","v":"] ] "},{"$f":"IF(Sheet2!E58=\"\",\"\",Sheet2!E58)","v":""},{"$f":"IF(Sheet2!F58=\"\",\"\",Sheet2!F58)","v":""},{"$f":"IF(Sheet2!G58=\"\",\"\",TEXT(Sheet2!G58,\"D-M-YYYY\"))","v":""},"","",{"$f":"IF(Sheet2!H58=\"\",\"\",Sheet2!H58)","v":""}]
[{"$f":"IF(OR(OR(OR(B57=\"\",C57=\"\",D57=\"\",E57=\"\"))),\"\",MAX($A$9:A56)+1)","v":""},{"$f":"Sheet2!B59&\"] \"&Sheet2!C59&\"] \"&Sheet2!D59","v":"] ] "},{"$f":"IF(Sheet2!E59=\"\",\"\",Sheet2!E59)","v":""},{"$f":"IF(Sheet2!F59=\"\",\"\",Sheet2!F59)","v":""},{"$f":"IF(Sheet2!G59=\"\",\"\",TEXT(Sheet2!G59,\"D-M-YYYY\"))","v":""},"","",{"$f":"IF(Sheet2!H59=\"\",\"\",Sheet2!H59)","v":""}]
[{"$f":"IF(OR(OR(OR(B58=\"\",C58=\"\",D58=\"\",E58=\"\"))),\"\",MAX($A$9:A57)+1)","v":""},{"$f":"Sheet2!B60&\"] \"&Sheet2!C60&\"] \"&Sheet2!D60","v":"] ] "},{"$f":"IF(Sheet2!E60=\"\",\"\",Sheet2!E60)","v":""},{"$f":"IF(Sheet2!F60=\"\",\"\",Sheet2!F60)","v":""},{"$f":"IF(Sheet2!G60=\"\",\"\",TEXT(Sheet2!G60,\"D-M-YYYY\"))","v":""},"","",{"$f":"IF(Sheet2!H60=\"\",\"\",Sheet2!H60)","v":""}]
["     izekf.kr fd;k tkrk gS fd mi;qZDr deZpkfj;ksa ds }kjk ,sls fdlh Hkh izdkj ds vodk'k dk miHkksx ugha fd;k gS] ftlls mudh okf\"kZd osru o`f) izHkkfor gksrh gksA"]
["     okf\"kZd osru o`f) dk ykHk tqykbZ ekg dh izFke fnukad ls ns; gksxk rFkk ekg dh izFke fnukad dks deZpkjh ds vkdfLed vodk'k dks NksMdj vU; fdlh Hkh izdkj ds vodk'k ij jgus dh fLFkfr esa okf\"kZd osru o`f) dk vkfFkZd ykHk deZpkjh ds vodk'k ls ykSVus dh fnukad ls ns; gksxkA okf\"kZd osru o`f) dk bUnzkt lacaf/kr deZpkjh dh lsok iqfLrdk esa ;Fkk LFkku dj fn;k x;k gSA"]
[]
[{"$nulls":5},"gLrk{kj MhMhvks e; in eqgj"]
["izfrfyfi fuEu dks lwpukFkZ ,oa vko';d dk;Zokgh gsrq izf\"kr gSA"]
["1- Jheku~ midks\"kkf/kdkjh] midks\"k dk;kZy; ----------------A"]
["2- ys[kk 'kk[kk] LFkkuh; dk;kZy;A"]
["3- lacaf/kr deZpkjh ----------------A"]
["4- jf{kr izfrfyfiA"]
[]
[{"$nulls":5},"gLrk{kj MhMhvks e; in eqgj"]

{"sheet":"Sheet4","index":3,"n_rows":56,"n_cols":7,"rows_kept":56,"merged":[[0,0,0,6],[1,0,1,6],[2,0,2,6],[3,0,3,6],[4,0,4,6],[5,0,5,6],[6,0,6,6],[7,0,7,6],[8,0,8,6],[9,0,9,6],[10,0,10,6],[11,0,11,6],[12,0,12,6],[13,0,13,6],[14,0,15,0],[14,1,15,1],[14,2,15,2],[14,3,15,3],[14,4,14,5],[14,6,15,6]]}
["vkgj.k ,oa forj.k vf/kdkjh dk;kZy;↓"]
["jktdh; mPp ek/;fed fon~;ky; ekywrkuk ¼Fkkukxkth½ vyoj"]
["cksul o\"kZ↓"]
["2023&24"]
["cksul vkns'k fnukad↓"]
["2024-10-13"]
["dqy ns; cksul jkf'k↓"]
[6774]
["izksfoMsUV Q.M esa tek izfr'kr↓"]
[25]
["Lohd`rh vkns'k Øekad↓"]
[1636]
["Lohd`rh vkns'k fnukad↓"]
["2024-10-15"]
["Ø- la-","uke deZpkjh","in uke","inLFkkiu LFkku",{"$f":"\"31-03-\"&LEFT(A4,4)+1&\" dks izkIr osru\"","v":"31-03-2024 dks izkIr osru"},null,"ns; cksul ekg"]
[{"$nulls":4},"is&ysoy","osru"]
[1,"izeksn dqekj lSuh","v/;kid","jkmekfo ekywrkuk",{"v":11,"d":",y & 11"},49300,12]
[2]
[3]
[4,"izeksn dqekj lSuh","v/;kid","jkmekfo ekywrkuk",{"v":11,"d":",y & 11"},50800,6]
[5]
[6]
[7]
[8]
[9]
[10]
[11]
[12]
[13]
[14]
[15]
[16]
[17]
[18]
[19]
[20]
[21]
[22]
[23]
[24]
[25]
[26]
[27]
[28]
[29]
[30]
[31]
[32]
[33]
[34]
[35]
[36]
[37]
[38]
[39]
[40]

{"sheet":"Sheet5","index":4,"n_rows":55,"n_cols":8,"rows_kept":55,"merged":[[0,0,0,7],[3,0,3,7],[4,0,4,7],[5,0,6,0],[5,1,6,1],[5,2,5,3],[5,4,6,4],[5,5,6,5],[5,6,6,6],[5,7,6,7],[48,5,48,7],[54,5,54,7]]}
[{"$f":"\"dk;kZy; \"&Sheet4!A2","v":"dk;kZy; jktdh; mPp ek/;fed fon~;ky; ekywrkuk ¼Fkkukxkth½ vyoj"}]
[{"$f":"\"dzekad % \"&Sheet4!A12","v":"dzekad % 1636"},{"$nulls":6},{"$f":"\"fnukad % \"&IF(Sheet4!A14=\"\",\"\",TEXT(Sheet4!A14,\"DD-MM-YYYY\"))","v":"fnukad % 15-10-2024"}]
[]
["dk;kZy; vkns'k"]
[{"$f":"\"     foÙk foHkkx jktLFkku ljdkj ds vkns'k dzekad ,Q-6¼5½,QMh¼#Yl½@2009 t;iqj] fnukad \"&TEXT(Sheet4!A6,\"DD-MM-YYYY\")&\" dh vuqikyuk esa bl dk;kZy; ds fuEu vjktif=r deZpkjh tks 01 vizSy] \"&LEFT(Sheet4!A4,4)+1&\" dks jktdh; lsok esa fujarj dk;Zjr Fks rFkk jktLFkku flfoy lsok ¼iqujhf{kr osru½ fu;e] 2017 esa is eSfVªDl ysoy 12 vFkok blls de es osru vkgfjr dj jgs FksA budks foÙkh; o\"\"kZ \"&Sheet4!A4&\" gsrq rnFkZ cksul jkT; ljdkj }kjk fu/kkZfjr fu;eksa ds varxZr Lohd`r fd;k tkrk gSA\"","v":"     foÙk foHkkx jktLFkku ljdkj ds vkns'k dzekad ,Q-6¼5½,QMh¼#Yl½@2009 t;iqj] fnukad 13-10-2024 dh vuqikyuk esa bl dk;kZy; ds fuEu vjktif=r deZpkjh tks 01 vizSy] 2024 dks jktdh; lsok esa fujarj dk;Zjr Fks rFkk jktLFkku flfoy lsok ¼iqujhf{kr osru½ fu;e] 2017 esa is eSfVªDl ysoy 12 vFkok blls de es osru vkgfjr dj jgs FksA budks foÙkh; o\"kZ 2023&24 gsrq rnFkZ cksul jkT; ljdkj }kjk fu/kkZfjr fu;eksa ds varxZr Lohd`r fd;k tkrk gSA"}]
["Ø- \nla-","uke deZpkjh] in uke ,oa inLFkkiu LFkku",{"$f":"\"31-03-\"&LEFT(Sheet4!A4,4)+1&\" dks izkIr osru\"","v":"31-03-2024 dks izkIr osru"},null,"ns; cksul ekg","dqy cksul jkf'k","izksfoMsUV Q.M esa tek jkf'k","udn ns; jkf'k"]
[null,null,"is&ysoy","ewy osru"]
[{"$f":"IF(OR(OR(OR(OR(OR(B8=\"\",C8=\"\",D8=\"\",E8=\"\"))))),\"\",1)","v":1},{"$f":"Sheet4!B17&\"] \"&Sheet4!C17&\"] \"&Sheet4!D17","v":"izeksn dqekj lSuh] v/;kid] jkmekfo ekywrkuk"},{"$f":"IF(Sheet4!E17=\"\",\"\",Sheet4!E17)","v":{"v":11,"d":",y & 11"}},{"$f":"IF(Sheet4!F17=\"\",\"\",Sheet4!F17)","v":49300},{"$f":"IF(Sheet4!G17=\"\",\"\",Sheet4!G17)","v":12},{"$f":"IFERROR(ROUND((Sheet4!$A$8/12)*Sheet5!E8,0),\"\")","v":6774},{"$f":"IFERROR(ROUND(F8*Sheet4!$A$10/100,0),\"\")","v":1694},{"$f":"IFERROR(F8-G8,\"\")","v":5080}]
[{"$f":"IF(OR(OR(OR(B9=\"\",C9=\"\",D9=\"\",E9=\"\"))),\"\",MAX($A$8:A8)+1)","v":""},{"$f":"Sheet4!B18&\"] \"&Sheet4!C18&\"] \"&Sheet4!D18","v":"] ] "},{"$f":"IF(Sheet4!E18=\"\",\"\",Sheet4!E18)","v":""},{"$f":"IF(Sheet4!F18=\"\",\"\",Sheet4!F18)","v":""},{"$f":"IF(Sheet4!G18=\"\",\"\",Sheet4!G18)","v":""},{"$f":"IFERROR(ROUND((Sheet4!$A$8/12)*Sheet5!E9,0),\"\")","v":""},{"$f":"IFERROR(ROUND(F9*Sheet4!$A$10/100,0),\"\")","v":""},{"$f":"IFERROR(F9-G9,\"\")","v":""}]
[{"$f":"IF(OR(OR(OR(B10=\"\",C10=\"\",D10=\"\",E10=\"\"))),\"\",MAX($A$8:A9)+1)","v":""},{"$f":"Sheet4!B19&\"] \"&Sheet4!C19&\"] \"&Sheet4!D19","v":"] ] "},{"$f":"IF(Sheet4!E19=\"\",\"\",Sheet4!E19)","v":""},{"$f":"IF(Sheet4!F19=\"\",\"\",Sheet4!F19)","v":""},{"$f":"IF(Sheet4!G19=\"\",\"\",Sheet4!G19)","v":""},{"$f":"IFERROR(ROUND((Sheet4!$A$8/12)*Sheet5!E10,0),\"\")","v":""},{"$f":"IFERROR(ROUND(F10*Sheet4!$A$10/100,0),\"\")","v":""},""]
[{"$f":"IF(OR(OR(OR(B11=\"\",C11=\"\",D11=\"\",E11=\"\"))),\"\",MAX($A$8:A10)+1)","v":2},{"$f":"Sheet4!B20&\"] \"&Sheet4!C20&\"] \"&Sheet4!D20","v":"izeksn dqekj lSuh] v/;kid] jkmekfo ekywrkuk"},{"$f":"IF(Sheet4!E20=\"\",\"\",Sheet4!E20)","v":{"v":11,"d":",y & 11"}},{"$f":"IF(Sheet4!F20=\"\",\"\",Sheet4!F20)","v":50800},{"$f":"IF(Sheet4!G20=\"\",\"\",Sheet4!G20)","v":6},{"$f":"IFERROR(ROUND((Sheet4!$A$8/12)*Sheet5!E11,0),\"\")","v":3387},{"$f":"IFERROR(ROUND(F11*Sheet4!$A$10/100,0),\"\")","v":847},2540]
[{"$f":"IF(OR(OR(OR(B12=\"\",C12=\"\",D12=\"\",E12=\"\"))),\"\",MAX($A$8:A11)+1)","v":""},{"$f":"Sheet4!B21&\"] \"&Sheet4!C21&\"] \"&Sheet4!D21","v":"] ] "},{"$f":"IF(Sheet4!E21=\"\",\"\",Sheet4!E21)","v":""},{"$f":"IF(Sheet4!F21=\"\",\"\",Sheet4!F21)","v":""},{"$f":"IF(Sheet4!G21=\"\",\"\",Sheet4!G21)","v":""},{"$f":"IFERROR(ROUND((Sheet4!$A$8/12)*Sheet5!E12,0),\"\")","v":""},{"$f":"IFERROR(ROUND(F12*Sheet4!$A$10/100,0),\"\")","v":""},""]
[{"$f":"IF(OR(OR(OR(B13=\"\",C13=\"\",D13=\"\",E13=\"\"))),\"\",MAX($A$8:A12)+1)","v":""},{"$f":"Sheet4!B22&\"] \"&Sheet4!C22&\"] \"&Sheet4!D22","v":"] ] "},{"$f":"IF(Sheet4!E22=\"\",\"\",Sheet4!E22)","v":""},{"$f":"IF(Sheet4!F22=\"\",\"\",Sheet4!F22)","v":""},{"$f":"IF(Sheet4!G22=\"\",\"\",Sheet4!G22)","v":""},{"$f":"IFERROR(ROUND((Sheet4!$A$8/12)*Sheet5!E13,0),\"\")","v":""},{"$f":"IFERROR(ROUND(F13*Sheet4!$A$10/100,0),\"\")","v":""},""]
[{"$f":"IF(OR(OR(OR(B14=\"\",C14=\"\",D14=\"\",E14=\"\"))),\"\",MAX($A$8:A13)+1)","v":""},{"$f":"Sheet4!B23&\"] \"&Sheet4!C23&\"] \"&Sheet4!D23","v":"] ] "},{"$f":"IF(Sheet4!E23=\"\",\"\",Sheet4!E23)","v":""},{"$f":"IF(Sheet4!F23=\"\",\"\",Sheet4!F23)","v":""},{"$f":"IF(Sheet4!G23=\"\",\"\",Sheet4!G23)","v":""},{"$f":"IFERROR(ROUND((Sheet4!$A$8/12)*Sheet5!E14,0),\"\")","v":""},{"$f":"IFERROR(ROUND(F14*Sheet4!$A$10/100,0),\"\")","v":""},""]
[{"$f":"IF(OR(OR(OR(B15=\"\",C15=\"\",D15=\"\",E15=\"\"))),\"\",MAX($A$8:A14)+1)","v":""},{"$f":"Sheet4!B24&\"] \"&Sheet4!C24&\"] \"&Sheet4!D24","v":"] ] "},{"$f":"IF(Sheet4!E24=\"\",\"\",Sheet4!E24)","v":""},{"$f":"IF(Sheet4!F24=\"\",\"\",Sheet4!F24)","v":""},{"$f":"IF(Sheet4!G24=\"\",\"\",Sheet4!G24)","v":""},{"$f":"IFERROR(ROUND((Sheet4!$A$8/12)*Sheet5!E15,0),\"\")","v":""},{"$f":"IFERROR(ROUND(F15*Sheet4!$A$10/100,0),\"\")","v":""},""]
[{"$f":"IF(OR(OR(OR(B16=\"\",C16=\"\",D16=\"\",E16=\"\"))),\"\",MAX($A$8:A15)+1)","v":""},{"$f":"Sheet4!B25&\"] \"&Sheet4!C25&\"] \"&Sheet4!D25","v":"] ] "},{"$f":"IF(Sheet4!E25=\"\",\"\",Sheet4!E25)","v":""},{"$f":"IF(Sheet4!F25=\"\",\"\",Sheet4!F25)","v":""},{"$f":"IF(Sheet4!G25=\"\",\"\",Sheet4!G25)","v":""},{"$f":"IFERROR(ROUND((Sheet4!$A$8/12)*Sheet5!E16,0),\"\")","v":""},{"$f":"IFERROR(ROUND(F16*Sheet4!$A$10/100,0),\"\")","v":""},""]
[{"$f":"IF(OR(OR(OR(B17=\"\",C17=\"\",D17=\"\",E17=\"\"))),\"\",MAX($A$8:A16)+1)","v":""},{"$f":"Sheet4!B26&\"] \"&Sheet4!C26&\"] \"&Sheet4!D26","v":"] ] "},{"$f":"IF(Sheet4!E26=\"\",\"\",Sheet4!E26)","v":""},{"$f":"IF(Sheet4!F26=\"\",\"\",Sheet4!F26)","v":""},{"$f":"IF(Sheet4!G26=\"\",\"\",Sheet4!G26)","v":""},{"$f":"IFERROR(ROUND((Sheet4!$A$8/12)*Sheet5!E17,0),\"\")","v":""},{"$f":"IFERROR(ROUND(F17*Sheet4!$A$10/100,0),\"\")","v":""},""]
[{"$f":"IF(OR(OR(OR(B18=\"\",C18=\"\",D18=\"\",E18=\"\"))),\"\",MAX($A$8:A17)+1)","v":""},{"$f":"Sheet4!B27&\"] \"&Sheet4!C27&\"] \"&Sheet4!D27","v":"] ] "},{"$f":"IF(Sheet4!E27=\"\",\"\",Sheet4!E27)","v":""},{"$f":"IF(Sheet4!F27=\"\",\"\",Sheet4!F27)","v":""},{"$f":"IF(Sheet4!G27=\"\",\"\",Sheet4!G27)","v":""},{"$f":"IFERROR(ROUND((Sheet4!$A$8/12)*Sheet5!E18,0),\"\")","v":""},{"$f":"IFERROR(ROUND(F18*Sheet4!$A$10/100,0),\"\")","v":""},""]
[{"$f":"IF(OR(OR(OR(B19=\"\",C19=\"\",D19=\"\",E19=\"\"))),\"\",MAX($A$8:A18)+1)","v":""},{"$f":"Sheet4!B28&\"] \"&Sheet4!C28&\"] \"&Sheet4!D28","v":"] ] "},{"$f":"IF(Sheet4!E28=\"\",\"\",Sheet4!E28)","v":""},{"$f":"IF(Sheet4!F28=\"\",\"\",Sheet4!F28)","v":""},{"$f":"IF(Sheet4!G28=\"\",\"\",Sheet4!G28)","v":""},{"$f":"IFERROR(ROUND((Sheet4!$A$8/12)*Sheet5!E19,0),\"\")","v":""},{"$f":"IFERROR(ROUND(F19*Sheet4!$A$10/100,0),\"\")","v":""},""]
[{"$f":"IF(OR(OR(OR(B20=\"\",C20=\"\",D20=\"\",E20=\"\"))),\"\",MAX($A$8:A19)+1)","v":""},{"$f":"Sheet4!B29&\"] \"&Sheet4!C29&\"] \"&Sheet4!D29","v":"] ] "},{"$f":"IF(Sheet4!E29=\"\",\"\",Sheet4!E29)","v":""},{"$f":"IF(Sheet4!F29=\"\",\"\",Sheet4!F29)","v":""},{"$f":"IF(Sheet4!G29=\"\",\"\",Sheet4!G29)","v":""},{"$f":"IFERROR(ROUND((Sheet4!$A$8/12)*Sheet5!E20,0),\"\")","v":""},{"$f":"IFERROR(ROUND(F20*Sheet4!$A$10/100,0),\"\")","v":""},""]
[{"$f":"IF(OR(OR(OR(B21=\"\",C21=\"\",D21=\"\",E21=\"\"))),\"\",MAX($A$8:A20)+1)","v":""},{"$f":"Sheet4!B30&\"] \"&Sheet4!C30&\"] \"&Sheet4!D30","v":"] ] "},{"$f":"IF(Sheet4!E30=\"\",\"\",Sheet4!E30)","v":""},{"$f":"IF(Sheet4!F30=\"\",\"\",Sheet4!F30)","v":""},{"$f":"IF(Sheet4!G30=\"\",\"\",Sheet4!G30)","v":""},{"$f":"IFERROR(ROUND((Sheet4!$A$8/12)*Sheet5!E21,0),\"\")","v":""},{"$f":"IFERROR(ROUND(F21*Sheet4!$A$10/100,0),\"\")","v":""},""]
[{"$f":"IF(OR(OR(OR(B22=\"\",C22=\"\",D22=\"\",E22=\"\"))),\"\",MAX($A$8:A21)+1)","v":""},{"$f":"Sheet4!B31&\"] \"&Sheet4!C31&\"] \"&Sheet4!D31","v":"] ] "},{"$f":"IF(Sheet4!E31=\"\",\"\",Sheet4!E31)","v":""},{"$f":"IF(Sheet4!F31=\"\",\"\",Sheet4!F31)","v":""},{"$f":"IF(Sheet4!G31=\"\",\"\",Sheet4!G31)","v":""},{"$f":"IFERROR(ROUND((Sheet4!$A$8/12)*Sheet5!E22,0),\"\")","v":""},{"$f":"IFERROR(ROUND(F22*Sheet4!$A$10/100,0),\"\")","v":""},""]
[{"$f":"IF(OR(OR(OR(B23=\"\",C23=\"\",D23=\"\",E23=\"\"))),\"\",MAX($A$8:A22)+1)","v":""},{"$f":"Sheet4!B32&\"] \"&Sheet4!C32&\"] \"&Sheet4!D32","v":"] ] "},{"$f":"IF(Sheet4!E32=\"\",\"\",Sheet4!E32)","v":""},{"$f":"IF(Sheet4!F32=\"\",\"\",Sheet4!F32)","v":""},{"$f":"IF(Sheet4!G32=\"\",\"\",Sheet4!G32)","v":""},{"$f":"IFERROR(ROUND((Sheet4!$A$8/12)*Sheet5!E23,0),\"\")","v":""},{"$f":"IFERROR(ROUND(F23*Sheet4!$A$10/100,0),\"\")","v":""},""]
[{"$f":"IF(OR(OR(OR(B24=\"\",C24=\"\",D24=\"\",E24=\"\"))),\"\",MAX($A$8:A23)+1)","v":""},{"$f":"Sheet4!B33&\"] \"&Sheet4!C33&\"] \"&Sheet4!D33","v":"] ] "},{"$f":"IF(Sheet4!E33=\"\",\"\",Sheet4!E33)","v":""},{"$f":"IF(Sheet4!F33=\"\",\"\",Sheet4!F33)","v":""},{"$f":"IF(Sheet4!G33=\"\",\"\",Sheet4!G33)","v":""},{"$f":"IFERROR(ROUND((Sheet4!$A$8/12)*Sheet5!E24,0),\"\")","v":""},{"$f":"IFERROR(ROUND(F24*Sheet4!$A$10/100,0),\"\")","v":""},""]
[{"$f":"IF(OR(OR(OR(B25=\"\",C25=\"\",D25=\"\",E25=\"\"))),\"\",MAX($A$8:A24)+1)","v":""},{"$f":"Sheet4!B34&\"] \"&Sheet4!C34&\"] \"&Sheet4!D34","v":"] ] "},{"$f":"IF(Sheet4!E34=\"\",\"\",Sheet4!E34)","v":""},{"$f":"IF(Sheet4!F34=\"\",\"\",Sheet4!F34)","v":""},{"$f":"IF(Sheet4!G34=\"\",\"\",Sheet4!G34)","v":""},{"$f":"IFERROR(ROUND((Sheet4!$A$8/12)*Sheet5!E25,0),\"\")","v":""},{"$f":"IFERROR(ROUND(F25*Sheet4!$A$10/100,0),\"\")","v":""},""]
[{"$f":"IF(OR(OR(OR(B26=\"\",C26=\"\",D26=\"\",E26=\"\"))),\"\",MAX($A$8:A25)+1)","v":""},{"$f":"Sheet4!B35&\"] \"&Sheet4!C35&\"] \"&Sheet4!D35","v":"] ] "},{"$f":"IF(Sheet4!E35=\"\",\"\",Sheet4!E35)","v":""},{"$f":"IF(Sheet4!F35=\"\",\"\",Sheet4!F35)","v":""},{"$f":"IF(Sheet4!G35=\"\",\"\",Sheet4!G35)","v":""},{"$f":"IFERROR(ROUND((Sheet4!$A$8/12)*Sheet5!E26,0),\"\")","v":""},{"$f":"IFERROR(ROUND(F26*Sheet4!$A$10/100,0),\"\")","v":""},""]
[{"$f":"IF(OR(OR(OR(B27=\"\",C27=\"\",D27=\"\",E27=\"\"))),\"\",MAX($A$8:A26)+1)","v":""},{"$f":"Sheet4!B36&\"] \"&Sheet4!C36&\"] \"&Sheet4!D36","v":"] ] "},{"$f":"IF(Sheet4!E36=\"\",\"\",Sheet4!E36)","v":""},{"$f":"IF(Sheet4!F36=\"\",\"\",Sheet4!F36)","v":""},{"$f":"IF(Sheet4!G36=\"\",\"\",Sheet4!G36)","v":""},{"$f":"IFERROR(ROUND((Sheet4!$A$8/12)*Sheet5!E27,0),\"\")","v":""},{"$f":"IFERROR(ROUND(F27*Sheet4!$A$10/100,0),\"\")","v":""},""]
[{"$f":"IF(OR(OR(OR(B28=\"\",C28=\"\",D28=\"\",E28=\"\"))),\"\",MAX($A$8:A27)+1)","v":""},{"$f":"Sheet4!B37&\"] \"&Sheet4!C37&\"] \"&Sheet4!D37","v":"] ] "},{"$f":"IF(Sheet4!E37=\"\",\"\",Sheet4!E37)","v":""},{"$f":"IF(Sheet4!F37=\"\",\"\",Sheet4!F37)","v":""},{"$f":"IF(Sheet4!G37=\"\",\"\",Sheet4!G37)","v":""},{"$f":"IFERROR(ROUND((Sheet4!$A$8/12)*Sheet5!E28,0),\"\")","v":""},{"$f":"IFERROR(ROUND(F28*Sheet4!$A$10/100,0),\"\")","v":""},""]
[{"$f":"IF(OR(OR(OR(B29=\"\",C29=\"\",D29=\"\",E29=\"\"))),\"\",MAX($A$8:A28)+1)","v":""},{"$f":"Sheet4!B38&\"] \"&Sheet4!C38&\"] \"&Sheet4!D38","v":"] ] "},{"$f":"IF(Sheet4!E38=\"\",\"\",Sheet4!E38)","v":""},{"$f":"IF(Sheet4!F38=\"\",\"\",Sheet4!F38)","v":""},{"$f":"IF(Sheet4!G38=\"\",\"\",Sheet4!G38)","v":""},{"$f":"IFERROR(ROUND((Sheet4!$A$8/12)*Sheet5!E29,0),\"\")","v":""},{"$f":"IFERROR(ROUND(F29*Sheet4!$A$10/100,0),\"\")","v":""},""]
[{"$f":"IF(OR(OR(OR(B30=\"\",C30=\"\",D30=\"\",E30=\"\"))),\"\",MAX($A$8:A29)+1)","v":""},{"$f":"Sheet4!B39&\"] \"&Sheet4!C39&\"] \"&Sheet4!D39","v":"] ] "},{"$f":"IF(Sheet4!E39=\"\",\"\",Sheet4!E39)","v":""},{"$f":"IF(Sheet4!F39=\"\",\"\",Sheet4!F39)","v":""},{"$f":"IF(Sheet4!G39=\"\",\"\",Sheet4!G39)","v":""},{"$f":"IFERROR(ROUND((Sheet4!$A$8/12)*Sheet5!E30,0),\"\")","v":""},{"$f":"IFERROR(ROUND(F30*Sheet4!$A$10/100,0),\"\")","v":""},""]
[{"$f":"IF(OR(OR(OR(B31=\"\",C31=\"\",D31=\"\",E31=\"\"))),\"\",MAX($A$8:A30)+1)","v":""},{"$f":"Sheet4!B40&\"] \"&Sheet4!C40&\"] \"&Sheet4!D40","v":"] ] "},{"$f":"IF(Sheet4!E40=\"\",\"\",Sheet4!E40)","v":""},{"$f":"IF(Sheet4!F40=\"\",\"\",Sheet4!F40)","v":""},{"$f":"IF(Sheet4!G40=\"\",\"\",Sheet4!G40)","v":""},{"$f":"IFERROR(ROUND((Sheet4!$A$8/12)*Sheet5!E31,0),\"\")","v":""},{"$f":"IFERROR(ROUND(F31*Sheet4!$A$10/100,0),\"\")","v":""},""]
[{"$f":"IF(OR(OR(OR(B32=\"\",C32=\"\",D32=\"\",E32=\"\"))),\"\",MAX($A$8:A31)+1)","v":""},{"$f":"Sheet4!B41&\"] \"&Sheet4!C41&\"] \"&Sheet4!D41","v":"] ] "},{"$f":"IF(Sheet4!E41=\"\",\"\",Sheet4!E41)","v":""},{"$f":"IF(Sheet4!F41=\"\",\"\",Sheet4!F41)","v":""},{"$f":"IF(Sheet4!G41=\"\",\"\",Sheet4!G41)","v":""},{"$f":"IFERROR(ROUND((Sheet4!$A$8/12)*Sheet5!E32,0),\"\")","v":""},{"$f":"IFERROR(ROUND(F32*Sheet4!$A$10/100,0),\"\")","v":""},""]
[{"$f":"IF(OR(OR(OR(B33=\"\",C33=\"\",D33=\"\",E33=\"\"))),\"\",MAX($A$8:A32)+1)","v":""},{"$f":"Sheet4!B42&\"] \"&Sheet4!C42&\"] \"&Sheet4!D42","v":"] ] "},{"$f":"IF(Sheet4!E42=\"\",\"\",Sheet4!E42)","v":""},{"$f":"IF(Sheet4!F42=\"\",\"\",Sheet4!F42)","v":""},{"$f":"IF(Sheet4!G42=\"\",\"\",Sheet4!G42)","v":""},{"$f":"IFERROR(ROUND((Sheet4!$A$8/12)*Sheet5!E33,0),\"\")","v":""},{"$f":"IFERROR(ROUND(F33*Sheet4!$A$10/100,0),\"\")","v":""},""]
[{"$f":"IF(OR(OR(OR(B34=\"\",C34=\"\",D34=\"\",E34=\"\"))),\"\",MAX($A$8:A33)+1)","v":""},{"$f":"Sheet4!B43&\"] \"&Sheet4!C43&\"] \"&Sheet4!D43","v":"] ] "},{"$f":"IF(Sheet4!E43=\"\",\"\",Sheet4!E43)","v":""},{"$f":"IF(Sheet4!F43=\"\",\"\",Sheet4!F43)","v":""},{"$f":"IF(Sheet4!G43=\"\",\"\",Sheet4!G43)","v":""},{"$f":"IFERROR(ROUND((Sheet4!$A$8/12)*Sheet5!E34,0),\"\")","v":""},{"$f":"IFERROR(ROUND(F34*Sheet4!$A$10/100,0),\"\")","v":""},""]
[{"$f":"IF(OR(OR(OR(B35=\"\",C35=\"\",D35=\"\",E35=\"\"))),\"\",MAX($A$8:A34)+1)","v":""},{"$f":"Sheet4!B44&\"] \"&Sheet4!C44&\"] \"&Sheet4!D44","v":"] ] "},{"$f":"IF(Sheet4!E44=\"\",\"\",Sheet4!E44)","v":""},{"$f":"IF(Sheet4!F44=\"\",\"\",Sheet4!F44)","v":""},{"$f":"IF(Sheet4!G44=\"\",\"\",Sheet4!G44)","v":""},{"$f":"IFERROR(ROUND((Sheet4!$A$8/12)*Sheet5!E35,0),\"\")","v":""},{"$f":"IFERROR(ROUND(F35*Sheet4!$A$10/100,0),\"\")","v":""},""]
[{"$f":"IF(OR(OR(OR(B36=\"\",C36=\"\",D36=\"\",E36=\"\"))),\"\",MAX($A$8:A35)+1)","v":""},{"$f":"Sheet4!B45&\"] \"&Sheet4!C45&\"] \"&Sheet4!D45","v":"] ] "},{"$f":"IF(Sheet4!E45=\"\",\"\",Sheet4!E45)","v":""},{"$f":"IF(Sheet4!F45=\"\",\"\",Sheet4!F45)","v":""},{"$f":"IF(Sheet4!G45=\"\",\"\",Sheet4!G45)","v":""},{"$f":"IFERROR(ROUND((Sheet4!$A$8/12)*Sheet5!E36,0),\"\")","v":""},{"$f":"IFERROR(ROUND(F36*Sheet4!$A$10/100,0),\"\")","v":""},""]
[{"$f":"IF(OR(OR(OR(B37=\"\",C37=\"\",D37=\"\",E37=\"\"))),\"\",MAX($A$8:A36)+1)","v":""},{"$f":"Sheet4!B46&\"] \"&Sheet4!C46&\"] \"&Sheet4!D46","v":"] ] "},{"$f":"IF(Sheet4!E46=\"\",\"\",Sheet4!E46)","v":""},{"$f":"IF(Sheet4!F46=\"\",\"\",Sheet4!F46)","v":""},{"$f":"IF(Sheet4!G46=\"\",\"\",Sheet4!G46)","v":""},{"$f":"IFERROR(ROUND((Sheet4!$A$8/12)*Sheet5!E37,0),\"\")","v":""},{"$f":"IFERROR(ROUND(F37*Sheet4!$A$10/100,0),\"\")","v":""},""]
[{"$f":"IF(OR(OR(OR(B38=\"\",C38=\"\",D38=\"\",E38=\"\"))),\"\",MAX($A$8:A37)+1)","v":""},{"$f":"Sheet4!B47&\"] \"&Sheet4!C47&\"] \"&Sheet4!D47","v":"] ] "},{"$f":"IF(Sheet4!E47=\"\",\"\",Sheet4!E47)","v":""},{"$f":"IF(Sheet4!F47=\"\",\"\",Sheet4!F47)","v":""},{"$f":"IF(Sheet4!G47=\"\",\"\",Sheet4!G47)","v":""},{"$f":"IFERROR(ROUND((Sheet4!$A$8/12)*Sheet5!E38,0),\"\")","v":""},{"$f":"IFERROR(ROUND(F38*Sheet4!$A$10/100,0),\"\")","v":""},{"$f":"IFERROR(F38-G38,\"\")","v":""}]
[{"$f":"IF(OR(OR(OR(B39=\"\",C39=\"\",D39=\"\",E39=\"\"))),\"\",MAX($A$8:A38)+1)","v":""},{"$f":"Sheet4!B48&\"] \"&Sheet4!C48&\"] \"&Sheet4!D48","v":"] ] "},{"$f":"IF(Sheet4!E48=\"\",\"\",Sheet4!E48)","v":""},{"$f":"IF(Sheet4!F48=\"\",\"\",Sheet4!F48)","v":""},{"$f":"IF(Sheet4!G48=\"\",\"\",Sheet4!G48)","v":""},{"$f":"IFERROR(ROUND((Sheet4!$A$8/12)*Sheet5!E39,0),\"\")","v":""},{"$f":"IFERROR(ROUND(F39*Sheet4!$A$10/100,0),\"\")","v":""},""]
[{"$f":"IF(OR(OR(OR(B40=\"\",C40=\"\",D40=\"\",E40=\"\"))),\"\",MAX($A$8:A39)+1)","v":""},{"$f":"Sheet4!B49&\"] \"&Sheet4!C49&\"] \"&Sheet4!D49","v":"] ] "},{"$f":"IF(Sheet4!E49=\"\",\"\",Sheet4!E49)","v":""},{"$f":"IF(Sheet4!F49=\"\",\"\",Sheet4!F49)","v":""},{"$f":"IF(Sheet4!G49=\"\",\"\",Sheet4!G49)","v":""},{"$f":"IFERROR(ROUND((Sheet4!$A$8/12)*Sheet5!E40,0),\"\")","v":""},{"$f":"IFERROR(ROUND(F40*Sheet4!$A$10/100,0),\"\")","v":""},""]
[{"$f":"IF(OR(OR(OR(B41=\"\",C41=\"\",D41=\"\",E41=\"\"))),\"\",MAX($A$8:A40)+1)","v":""},{"$f":"Sheet4!B50&\"] \"&Sheet4!C50&\"] \"&Sheet4!D50","v":"] ] "},{"$f":"IF(Sheet4!E50=\"\",\"\",Sheet4!E50)","v":""},{"$f":"IF(Sheet4!F50=\"\",\"\",Sheet4!F50)","v":""},{"$f":"IF(Sheet4!G50=\"\",\"\",Sheet4!G50)","v":""},{"$f":"IFERROR(ROUND((Sheet4!$A$8/12)*Sheet5!E41,0),\"\")","v":""},{"$f":"IFERROR(ROUND(F41*Sheet4!$A$10/100,0),\"\")","v":""},""]
[{"$f":"IF(OR(OR(OR(B42=\"\",C42=\"\",D42=\"\",E42=\"\"))),\"\",MAX($A$8:A41)+1)","v":""},{"$f":"Sheet4!B51&\"] \"&Sheet4!C51&\"] \"&Sheet4!D51","v":"] ] "},{"$f":"IF(Sheet4!E51=\"\",\"\",Sheet4!E51)","v":""},{"$f":"IF(Sheet4!F51=\"\",\"\",Sheet4!F51)","v":""},{"$f":"IF(Sheet4!G51=\"\",\"\",Sheet4!G51)","v":""},{"$f":"IFERROR(ROUND((Sheet4!$A$8/12)*Sheet5!E42,0),\"\")","v":""},{"$f":"IFERROR(ROUND(F42*Sheet4!$A$10/100,0),\"\")","v":""},""]
[{"$f":"IF(OR(OR(OR(B43=\"\",C43=\"\",D43=\"\",E43=\"\"))),\"\",MAX($A$8:A42)+1)","v":""},{"$f":"Sheet4!B52&\"] \"&Sheet4!C52&\"] \"&Sheet4!D52","v":"] ] "},{"$f":"IF(Sheet4!E52=\"\",\"\",Sheet4!E52)","v":""},{"$f":"IF(Sheet4!F52=\"\",\"\",Sheet4!F52)","v":""},{"$f":"IF(Sheet4!G52=\"\",\"\",Sheet4!G52)","v":""},{"$f":"IFERROR(ROUND((Sheet4!$A$8/12)*Sheet5!E43,0),\"\")","v":""},{"$f":"IFERROR(ROUND(F43*Sheet4!$A$10/100,0),\"\")","v":""},""]
[{"$f":"IF(OR(OR(OR(B44=\"\",C44=\"\",D44=\"\",E44=\"\"))),\"\",MAX($A$8:A43)+1)","v":""},{"$f":"Sheet4!B53&\"] \"&Sheet4!C53&\"] \"&Sheet4!D53","v":"] ] "},{"$f":"IF(Sheet4!E53=\"\",\"\",Sheet4!E53)","v":""},{"$f":"IF(Sheet4!F53=\"\",\"\",Sheet4!F53)","v":""},{"$f":"IF(Sheet4!G53=\"\",\"\",Sheet4!G53)","v":""},{"$f":"IFERROR(ROUND((Sheet4!$A$8/12)*Sheet5!E44,0),\"\")","v":""},{"$f":"IFERROR(ROUND(F44*Sheet4!$A$10/100,0),\"\")","v":""},""]
[{"$f":"IF(OR(OR(OR(B45=\"\",C45=\"\",D45=\"\",E45=\"\"))),\"\",MAX($A$8:A44)+1)","v":""},{"$f":"Sheet4!B54&\"] \"&Sheet4!C54&\"] \"&Sheet4!D54","v":"] ] "},{"$f":"IF(Sheet4!E54=\"\",\"\",Sheet4!E54)","v":""},{"$f":"IF(Sheet4!F54=\"\",\"\",Sheet4!F54)","v":""},{"$f":"IF(Sheet4!G54=\"\",\"\",Sheet4!G54)","v":""},{"$f":"IFERROR(ROUND((Sheet4!$A$8/12)*Sheet5!E45,0),\"\")","v":""},{"$f":"IFERROR(ROUND(F45*Sheet4!$A$10/100,0),\"\")","v":""},""]
[{"$f":"IF(OR(OR(OR(B46=\"\",C46=\"\",D46=\"\",E46=\"\"))),\"\",MAX($A$8:A45)+1)","v":""},{"$f":"Sheet4!B55&\"] \"&Sheet4!C55&\"] \"&Sheet4!D55","v":"] ] "},{"$f":"IF(Sheet4!E55=\"\",\"\",Sheet4!E55)","v":""},{"$f":"IF(Sheet4!F55=\"\",\"\",Sheet4!F55)","v":""},{"$f":"IF(Sheet4!G55=\"\",\"\",Sheet4!G55)","v":""},{"$f":"IFERROR(ROUND((Sheet4!$A$8/12)*Sheet5!E46,0),\"\")","v":""},{"$f":"IFERROR(ROUND(F46*Sheet4!$A$10/100,0),\"\")","v":""},""]
[{"$f":"IF(OR(OR(OR(B47=\"\",C47=\"\",D47=\"\",E47=\"\"))),\"\",MAX($A$8:A46)+1)","v":""},{"$f":"Sheet4!B56&\"] \"&Sheet4!C56&\"] \"&Sheet4!D56","v":"] ] "},{"$f":"IF(Sheet4!E56=\"\",\"\",Sheet4!E56)","v":""},{"$f":"IF(Sheet4!F56=\"\",\"\",Sheet4!F56)","v":""},{"$f":"IF(Sheet4!G56=\"\",\"\",Sheet4!G56)","v":""},{"$f":"IFERROR(ROUND((Sheet4!$A$8/12)*Sheet5!E47,0),\"\")","v":""},{"$f":"IFERROR(ROUND(F47*Sheet4!$A$10/100,0),\"\")","v":""},{"$f":"IFERROR(F47-G47,\"\")","v":""}]
[]
[{"$nulls":5},"gLrk{kj MhMhvks e; in eqgj"]
["izfrfyfi fuEu dks lwpukFkZ ,oa vko’;d dk;Zokgh gsrq iszf\"kr gSA"]
["1- Jheku~ midks\"kkf/kdkjh] midks\"k dk;kZy;-------------------A"]
["2- ys[kk 'kk[kk] LFkkuh; dk;kZy;A"]
["3- lacaf/k deZpkjh-------------A"]
[]
[{"$nulls":5},"gLrk{kj MhMhvks e; in eqgj"]

{"sheet":"Sheet6","index":5,"n_rows":30,"n_cols":9,"rows_kept":30,"merged":[[0,0,0,8],[1,0,1,8],[2,0,2,8],[3,0,3,8],[4,0,4,8],[5,0,5,8],[6,0,6,8],[7,0,7,8],[8,0,9,0],[8,1,9,1],[8,2,9,2],[8,3,9,3],[8,4,9,4],[8,5,9,5],[8,6,8,8]]}
["vkgj.k ,oa forj.k vf/kdkjh dk;kZy;↓"]
["jktdh; mPp ek/;fed fon~;ky; ekywrkuk ¼Fkkukxkth½ vyoj"]
["lefiZr foÙkh; o\"kZ↓"]
["2024&25"]
["Lohd`rh vkns'k Øekad↓"]
[1641]
["Lohd`rh vkns'k fnukad↓"]
["2024-10-22"]
["Ø- la-","uke deZpkjh","in uke","inLFkkiu LFkku","vkosfnr fnukad","Hkqxrku fnol","vkosfnr fnukad dks osru"]
[{"$nulls":6},"is&ysoy","osru","Mh-,- jsV"]
[1,"izeksn dqekj lSuh","v/;kid","jkckmizkfo ekywrkuk","2024-10-22",15,{"v":11,"d":",y & 11"},45100,50]
[2]
[3,"izeksn dqekj lSuh","v/;kid","jkmekfo ekywrkuk","2025-01-01",10,{"v":11,"d":",y & 11"},50800,53]
[4]
[5]
[6]
[7]
[8]
[9]
[10]
[11]
[12]
[13]
[14]
[15]
[16]
[17]
[18]
[19]
[20]

{"sheet":"Sheet7","index":6,"n_rows":35,"n_cols":7,"rows_kept":35,"merged":[[0,0,0,6],[3,0,3,6],[4,0,4,6],[5,0,6,0],[5,1,6,1],[5,2,6,2],[5,3,6,3],[5,4,5,6],[28,3,28,6],[34,3,34,6]]}
[{"$f":"\"dk;kZy; \"&Sheet6!A2","v":"dk;kZy; jktdh; mPp ek/;fed fon~;ky; ekywrkuk ¼Fkkukxkth½ vyoj"}]
[{"$f":"\"dzekad % \"&Sheet6!A6","v":"dzekad % 1641"},{"$nulls":5},{"$f":"\"fnukad % \"&IF(Sheet6!A8=\"\",\"\",TEXT(Sheet6!A8,\"dd-mm-yyyy\"))","v":"fnukad % 22-10-2024"}]
[]
["dk;kZy; vkns'k"]
[{"$f":"\"     bl dk;kZy; ds fuEu deZpkfj;ksa@deZpkjh ds }kjk vkosnu fd;s tkus ij jktLFkku lsok fu;e 91v ds vuqlj.k esa foÙkh; o\"\"kZ \"&Sheet6!A4&\" gsrq fuEukuqlkj mikftZr vodk'k ds udn Hkqxrku fd;s tkus dh Lohd`rh iznku dh tkrh gSA bl Lohd`rh dk bUnzkt lacaf/kr deZpkfj;ksa@deZpkjh dh lsok iqfLrdk esa dj fn;k x;k gSA \"","v":"     bl dk;kZy; ds fuEu deZpkfj;ksa@deZpkjh ds }kjk vkosnu fd;s tkus ij jktLFkku lsok fu;e 91v ds vuqlj.k esa foÙkh; o\"kZ 2024&25 gsrq fuEukuqlkj mikftZr vodk'k ds udn Hkqxrku fd;s tkus dh Lohd`rh iznku dh tkrh gSA bl Lohd`rh dk bUnzkt lacaf/kr deZpkfj;ksa@deZpkjh dh lsok iqfLrdk esa dj fn;k x;k gSA "}]
["dz- \nla-","uke deZpkjh] in uke ,oa inLFkkiu LFkku","vkosfnr fnukad","Hkqxrku fnol","udn ns; jkf'k"]
[{"$nulls":4},"ewy osru","Mh-,-",";ksx"]
[{"$f":"IF(OR(OR(B8=\"\",C8=\"\",D8=\"\")),\"\",1)","v":1},{"$f":"Sheet6!B11&\"] \"&Sheet6!C11&\"] \"&Sheet6!D11","v":"izeksn dqekj lSuh] v/;kid] jkckmizkfo ekywrkuk"},{"$f":"IF(Sheet6!E11=\"\",\"\",TEXT(Sheet6!E11,\"DD-MM-YYYY\"))","v":"22-10-2024"},{"$f":"IF(Sheet6!F11=\"\",\"\",Sheet6!F11)","v":15},{"$f":"IF(D8=\"\",\"\",ROUND((Sheet6!H11/30)*Sheet6!F11,0))","v":22550},{"$f":"IF(E8=\"\",\"\",ROUND(E8*Sheet6!I11/100,0))","v":11275},{"$f":"IF(A8=\"\",\"\",E8+F8)","v":33825}]
[{"$f":"IF(OR(OR(B9=\"\",C9=\"\",D9=\"\")),\"\",MAX($A$8:A8)+1)","v":""},{"$f":"Sheet6!B12&\"] \"&Sheet6!C12&\"] \"&Sheet6!D12","v":"] ] "},{"$f":"IF(Sheet6!E12=\"\",\"\",TEXT(Sheet6!E12,\"DD-MM-YYYY\"))","v":""},{"$f":"IF(Sheet6!F12=\"\",\"\",Sheet6!F12)","v":""},{"$f":"IF(D9=\"\",\"\",ROUND((Sheet6!H12/30)*Sheet6!F12,0))","v":""},{"$f":"IF(E9=\"\",\"\",ROUND(E9*Sheet6!I12/100,0))","v":""},""]
[{"$f":"IF(OR(OR(B10=\"\",C10=\"\",D10=\"\")),\"\",MAX($A$8:A9)+1)","v":2},{"$f":"Sheet6!B13&\"] \"&Sheet6!C13&\"] \"&Sheet6!D13","v":"izeksn dqekj lSuh] v/;kid] jkmekfo ekywrkuk"},{"$f":"IF(Sheet6!E13=\"\",\"\",TEXT(Sheet6!E13,\"DD-MM-YYYY\"))","v":"01-01-2025"},{"$f":"IF(Sheet6!F13=\"\",\"\",Sheet6!F13)","v":10},{"$f":"IF(D10=\"\",\"\",ROUND((Sheet6!H13/30)*Sheet6!F13,0))","v":16933},{"$f":"IF(E10=\"\",\"\",ROUND(E10*Sheet6!I13/100,0))","v":8974},25907]
[{"$f":"IF(OR(OR(B11=\"\",C11=\"\",D11=\"\")),\"\",MAX($A$8:A10)+1)","v":""},{"$f":"Sheet6!B14&\"] \"&Sheet6!C14&\"] \"&Sheet6!D14","v":"] ] "},{"$f":"IF(Sheet6!E14=\"\",\"\",TEXT(Sheet6!E14,\"DD-MM-YYYY\"))","v":""},{"$f":"IF(Sheet6!F14=\"\",\"\",Sheet6!F14)","v":""},{"$f":"IF(D11=\"\",\"\",ROUND((Sheet6!H14/30)*Sheet6!F14,0))","v":""},{"$f":"IF(E11=\"\",\"\",ROUND(E11*Sheet6!I14/100,0))","v":""},""]
[{"$f":"IF(OR(OR(B12=\"\",C12=\"\",D12=\"\")),\"\",MAX($A$8:A11)+1)","v":""},{"$f":"Sheet6!B15&\"] \"&Sheet6!C15&\"] \"&Sheet6!D15","v":"] ] "},{"$f":"IF(Sheet6!E15=\"\",\"\",TEXT(Sheet6!E15,\"DD-MM-YYYY\"))","v":""},{"$f":"IF(Sheet6!F15=\"\",\"\",Sheet6!F15)","v":""},{"$f":"IF(D12=\"\",\"\",ROUND((Sheet6!H15/30)*Sheet6!F15,0))","v":""},{"$f":"IF(E12=\"\",\"\",ROUND(E12*Sheet6!I15/100,0))","v":""},""]
[{"$f":"IF(OR(OR(B13=\"\",C13=\"\",D13=\"\")),\"\",MAX($A$8:A12)+1)","v":""},{"$f":"Sheet6!B16&\"] \"&Sheet6!C16&\"] \"&Sheet6!D16","v":"] ] "},{"$f":"IF(Sheet6!E16=\"\",\"\",TEXT(Sheet6!E16,\"DD-MM-YYYY\"))","v":""},{"$f":"IF(Sheet6!F16=\"\",\"\",Sheet6!F16)","v":""},{"$f":"IF(D13=\"\",\"\",ROUND((Sheet6!H16/30)*Sheet6!F16,0))","v":""},{"$f":"IF(E13=\"\",\"\",ROUND(E13*Sheet6!I16/100,0))","v":""},""]
[{"$f":"IF(OR(OR(B14=\"\",C14=\"\",D14=\"\")),\"\",MAX($A$8:A13)+1)","v":""},{"$f":"Sheet6!B17&\"] \"&Sheet6!C17&\"] \"&Sheet6!D17","v":"] ] "},{"$f":"IF(Sheet6!E17=\"\",\"\",TEXT(Sheet6!E17,\"DD-MM-YYYY\"))","v":""},{"$f":"IF(Sheet6!F17=\"\",\"\",Sheet6!F17)","v":""},{"$f":"IF(D14=\"\",\"\",ROUND((Sheet6!H17/30)*Sheet6!F17,0))","v":""},{"$f":"IF(E14=\"\",\"\",ROUND(E14*Sheet6!I17/100,0))","v":""},""]
[{"$f":"IF(OR(OR(B15=\"\",C15=\"\",D15=\"\")),\"\",MAX($A$8:A14)+1)","v":""},{"$f":"Sheet6!B18&\"] \"&Sheet6!C18&\"] \"&Sheet6!D18","v":"] ] "},{"$f":"IF(Sheet6!E18=\"\",\"\",TEXT(Sheet6!E18,\"DD-MM-YYYY\"))","v":""},{"$f":"IF(Sheet6!F18=\"\",\"\",Sheet6!F18)","v":""},{"$f":"IF(D15=\"\",\"\",ROUND((Sheet6!H18/30)*Sheet6!F18,0))","v":""},{"$f":"IF(E15=\"\",\"\",ROUND(E15*Sheet6!I18/100,0))","v":""},""]
[{"$f":"IF(OR(OR(B16=\"\",C16=\"\",D16=\"\")),\"\",MAX($A$8:A15)+1)","v":""},{"$f":"Sheet6!B19&\"] \"&Sheet6!C19&\"] \"&Sheet6!D19","v":"] ] "},{"$f":"IF(Sheet6!E19=\"\",\"\",TEXT(Sheet6!E19,\"DD-MM-YYYY\"))","v":""},{"$f":"IF(Sheet6!F19=\"\",\"\",Sheet6!F19)","v":""},{"$f":"IF(D16=\"\",\"\",ROUND((Sheet6!H19/30)*Sheet6!F19,0))","v":""},{"$f":"IF(E16=\"\",\"\",ROUND(E16*Sheet6!I19/100,0))","v":""},""]
[{"$f":"IF(OR(OR(B17=\"\",C17=\"\",D17=\"\")),\"\",MAX($A$8:A16)+1)","v":""},{"$f":"Sheet6!B20&\"] \"&Sheet6!C20&\"] \"&Sheet6!D20","v":"] ] "},{"$f":"IF(Sheet6!E20=\"\",\"\",TEXT(Sheet6!E20,\"DD-MM-YYYY\"))","v":""},{"$f":"IF(Sheet6!F20=\"\",\"\",Sheet6!F20)","v":""},{"$f":"IF(D17=\"\",\"\",ROUND((Sheet6!H20/30)*Sheet6!F20,0))","v":""},{"$f":"IF(E17=\"\",\"\",ROUND(E17*Sheet6!I20/100,0))","v":""},""]
[{"$f":"IF(OR(OR(B18=\"\",C18=\"\",D18=\"\")),\"\",MAX($A$8:A17)+1)","v":""},{"$f":"Sheet6!B21&\"] \"&Sheet6!C21&\"] \"&Sheet6!D21","v":"] ] "},{"$f":"IF(Sheet6!E21=\"\",\"\",TEXT(Sheet6!E21,\"DD-MM-YYYY\"))","v":""},{"$f":"IF(Sheet6!F21=\"\",\"\",Sheet6!F21)","v":""},{"$f":"IF(D18=\"\",\"\",ROUND((Sheet6!H21/30)*Sheet6!F21,0))","v":""},{"$f":"IF(E18=\"\",\"\",ROUND(E18*Sheet6!I21/100,0))","v":""},""]
[{"$f":"IF(OR(OR(B19=\"\",C19=\"\",D19=\"\")),\"\",MAX($A$8:A18)+1)","v":""},{"$f":"Sheet6!B22&\"] \"&Sheet6!C22&\"] \"&Sheet6!D22","v":"] ] "},{"$f":"IF(Sheet6!E22=\"\",\"\",TEXT(Sheet6!E22,\"DD-MM-YYYY\"))","v":""},{"$f":"IF(Sheet6!F22=\"\",\"\",Sheet6!F22)","v":""},{"$f":"IF(D19=\"\",\"\",ROUND((Sheet6!H22/30)*Sheet6!F22,0))","v":""},{"$f":"IF(E19=\"\",\"\",ROUND(E19*Sheet6!I22/100,0))","v":""},{"$f":"IF(A19=\"\",\"\",E19+F19)","v":""}]
[{"$f":"IF(OR(OR(B20=\"\",C20=\"\",D20=\"\")),\"\",MAX($A$8:A19)+1)","v":""},{"$f":"Sheet6!B23&\"] \"&Sheet6!C23&\"] \"&Sheet6!D23","v":"] ] "},{"$f":"IF(Sheet6!E23=\"\",\"\",TEXT(Sheet6!E23,\"DD-MM-YYYY\"))","v":""},{"$f":"IF(Sheet6!F23=\"\",\"\",Sheet6!F23)","v":""},{"$f":"IF(D20=\"\",\"\",ROUND((Sheet6!H23/30)*Sheet6!F23,0))","v":""},{"$f":"IF(E20=\"\",\"\",ROUND(E20*Sheet6!I23/100,0))","v":""},{"$f":"IF(A20=\"\",\"\",E20+F20)","v":""}]
[{"$f":"IF(OR(OR(B21=\"\",C21=\"\",D21=\"\")),\"\",MAX($A$8:A20)+1)","v":""},{"$f":"Sheet6!B24&\"] \"&Sheet6!C24&\"] \"&Sheet6!D24","v":"] ] "},{"$f":"IF(Sheet6!E24=\"\",\"\",TEXT(Sheet6!E24,\"DD-MM-YYYY\"))","v":""},{"$f":"IF(Sheet6!F24=\"\",\"\",Sheet6!F24)","v":""},{"$f":"IF(D21=\"\",\"\",ROUND((Sheet6!H24/30)*Sheet6!F24,0))","v":""},{"$f":"IF(E21=\"\",\"\",ROUND(E21*Sheet6!I24/100,0))","v":""},""]
[{"$f":"IF(OR(OR(B22=\"\",C22=\"\",D22=\"\")),\"\",MAX($A$8:A21)+1)","v":""},{"$f":"Sheet6!B25&\"] \"&Sheet6!C25&\"] \"&Sheet6!D25","v":"] ] "},{"$f":"IF(Sheet6!E25=\"\",\"\",TEXT(Sheet6!E25,\"DD-MM-YYYY\"))","v":""},{"$f":"IF(Sheet6!F25=\"\",\"\",Sheet6!F25)","v":""},{"$f":"IF(D22=\"\",\"\",ROUND((Sheet6!H25/30)*Sheet6!F25,0))","v":""},{"$f":"IF(E22=\"\",\"\",ROUND(E22*Sheet6!I25/100,0))","v":""},""]
[{"$f":"IF(OR(OR(B23=\"\",C23=\"\",D23=\"\")),\"\",MAX($A$8:A22)+1)","v":""},{"$f":"Sheet6!B26&\"] \"&Sheet6!C26&\"] \"&Sheet6!D26","v":"] ] "},{"$f":"IF(Sheet6!E26=\"\",\"\",TEXT(Sheet6!E26,\"DD-MM-YYYY\"))","v":""},{"$f":"IF(Sheet6!F26=\"\",\"\",Sheet6!F26)","v":""},{"$f":"IF(D23=\"\",\"\",ROUND((Sheet6!H26/30)*Sheet6!F26,0))","v":""},{"$f":"IF(E23=\"\",\"\",ROUND(E23*Sheet6!I26/100,0))","v":""},""]
[{"$f":"IF(OR(OR(B24=\"\",C24=\"\",D24=\"\")),\"\",MAX($A$8:A23)+1)","v":""},{"$f":"Sheet6!B27&\"] \"&Sheet6!C27&\"] \"&Sheet6!D27","v":"] ] "},{"$f":"IF(Sheet6!E27=\"\",\"\",TEXT(Sheet6!E27,\"DD-MM-YYYY\"))","v":""},{"$f":"IF(Sheet6!F27=\"\",\"\",Sheet6!F27)","v":""},{"$f":"IF(D24=\"\",\"\",ROUND((Sheet6!H27/30)*Sheet6!F27,0))","v":""},{"$f":"IF(E24=\"\",\"\",ROUND(E24*Sheet6!I27/100,0))","v":""},""]
[{"$f":"IF(OR(OR(B25=\"\",C25=\"\",D25=\"\")),\"\",MAX($A$8:A24)+1)","v":""},{"$f":"Sheet6!B28&\"] \"&Sheet6!C28&\"] \"&Sheet6!D28","v":"] ] "},{"$f":"IF(Sheet6!E28=\"\",\"\",TEXT(Sheet6!E28,\"DD-MM-YYYY\"))","v":""},{"$f":"IF(Sheet6!F28=\"\",\"\",Sheet6!F28)","v":""},{"$f":"IF(D25=\"\",\"\",ROUND((Sheet6!H28/30)*Sheet6!F28,0))","v":""},{"$f":"IF(E25=\"\",\"\",ROUND(E25*Sheet6!I28/100,0))","v":""},""]
[{"$f":"IF(OR(OR(B26=\"\",C26=\"\",D26=\"\")),\"\",MAX($A$8:A25)+1)","v":""},{"$f":"Sheet6!B29&\"] \"&Sheet6!C29&\"] \"&Sheet6!D29","v":"] ] "},{"$f":"IF(Sheet6!E29=\"\",\"\",TEXT(Sheet6!E29,\"DD-MM-YYYY\"))","v":""},{"$f":"IF(Sheet6!F29=\"\",\"\",Sheet6!F29)","v":""},{"$f":"IF(D26=\"\",\"\",ROUND((Sheet6!H29/30)*Sheet6!F29,0))","v":""},{"$f":"IF(E26=\"\",\"\",ROUND(E26*Sheet6!I29/100,0))","v":""},""]
[{"$f":"IF(OR(OR(B27=\"\",C27=\"\",D27=\"\")),\"\",MAX($A$8:A26)+1)","v":""},{"$f":"Sheet6!B30&\"] \"&Sheet6!C30&\"] \"&Sheet6!D30","v":"] ] "},{"$f":"IF(Sheet6!E30=\"\",\"\",TEXT(Sheet6!E30,\"DD-MM-YYYY\"))","v":""},{"$f":"IF(Sheet6!F30=\"\",\"\",Sheet6!F30)","v":""},{"$f":"IF(D27=\"\",\"\",ROUND((Sheet6!H30/30)*Sheet6!F30,0))","v":""},{"$f":"IF(E27=\"\",\"\",ROUND(E27*Sheet6!I30/100,0))","v":""},""]
[]
[{"$nulls":3},"gLrk{kj MhMhvks e; in eqgj"]
["izfrfyfi fuEu dks lwpukFkZ ,oa vko’;d dk;Zokgh gsrq iszf\"kr gSA"]
["1- Jheku~ midks\"kkf/kdkjh] midks\"k dk;kZy;-------------------A"]
["2- ys[kk 'kk[kk] LFkkuh; dk;kZy;A"]
["3- lacaf/kr deZpkjh-------------------A"]
[]
[{"$nulls":3},"gLrk{kj MhMhvks e; in eqgj"]

{"sheet":"Sheet8","index":7,"n_rows":17,"n_cols":9,"rows_kept":17,"merged":[[0,0,0,8],[1,0,1,8],[2,0,2,8],[3,0,3,8],[4,0,4,8],[5,0,5,8]]}
["vkgj.k ,oa forj.k vf/kdkjh dk;kZy;↓"]
["jktdh; mPp ek/;fed fon~;ky; ekywrkuk ¼Fkkukxkth½ vyoj"]
["Lohd`rh vkns'k Øekad↓"]
[1500]
["Lohd`rh vkns'k fnukad↓"]
["2023-07-15"]
["Ø- la-","uke deZpkjh","in uke","inLFkkiu LFkku","dk;Zxg.k fnukad","LFkkbZdj.k fnukad","vkosnu fnukad","Lohd`rh fnukad","Lohd`r ,pvk,"]
[1,"izeksn dqekj lSuh","v/;kid","jk m ek fo ekywrkuk","2023-07-21","2023-07-21","2023-07-01","2023-07-21",{"v":9,"d":"9 izfr'kr"}]
[2]
[3,"izeksn dqekj lSuh","v/;kid","jk m ek fo ekywrkuk","2010-01-17","2008-01-17","2010-01-17","2020-04-05",{"v":10,"d":"10 izfr'kr"}]
[4]
[5]
[6]
[7]
[8]
[9]
[10]

{"sheet":"Sheet9","index":8,"n_rows":24,"n_cols":7,"rows_kept":24,"merged":[[0,0,0,6],[3,0,3,6],[4,0,4,6],[17,4,17,6],[23,4,23,6]]}
[{"$f":"\"dk;kZy; \"&Sheet8!A2","v":"dk;kZy; jktdh; mPp ek/;fed fon~;ky; ekywrkuk ¼Fkkukxkth½ vyoj"}]
[{"$f":"\"dzekad % \"&Sheet8!A4","v":"dzekad % 1500"},{"$nulls":5},{"$f":"\"fnukad % \"&IF(Sheet8!A6=\"\",\"\",TEXT(Sheet8!A6,\"DD-MM-YYYY\"))","v":"fnukad % 15-07-2023"}]
[]
["dk;kZy; vkns'k"]
["     jktLFkku ljdkj ds vkns'k dzzekad ,Q 6¼4½ ,QMh@#Yl@07 fnukad 12-09-2008 la'kksf/kr nj fnukad 06-02-2009 ,oa jktLFkku flfoy lsok ¼iqujhf{kr osru½ fu;e] 2017 ds foÙk foHkkx ds vkns'k dzekad ,QMh 15¼1½ ,QMh@¼#Yl½ 2017 t;iqj fnukad 30-10-2017 ,oa lela[;ad la'kksf/kr vkns'k fnukad 09-12-2017 ds izko/kku vuqlkj jktLFkku lsok fu;eksa ds fu;e 7¼24½¼1½ esa ifjHkkf\"kr osru ds fu;e vuqlkj fuEu deZpkfj;ksa dks muds }kjk izLrqr vkosnu i=ksa ds vk/kkj ij edku fdjk;k HkÙkk vkgj.k dh muds uke ds laeqq[k vafdr fnukad ls ,rn~ }kjk Lohd`rh iznku dh tkrh gSA "]
["dz-la-","uke deZpkjh] in uke ,oa inLFkkiu LFkku","dk;Zxg.k fnukad","LFkkbZdj.k fnukad","vkosnu fnukad","Lohd`rh fnukad","Lohd`r ,pvk,"]
[{"$f":"IF(OR(OR(OR(B7=\"\",C7=\"\",D7=\"\",E7=\"\"))),\"\",1)","v":1},{"$f":"Sheet8!B8&\"] \"&Sheet8!C8&\"] \"&Sheet8!D8","v":"izeksn dqekj lSuh] v/;kid] jk m ek fo ekywrkuk"},{"$f":"IF(Sheet8!E8=\"\",\"\",TEXT(Sheet8!E8,\"DD-MM-YYYY\"))","v":"21-07-2023"},{"$f":"IF(Sheet8!F8=\"\",\"\",TEXT(Sheet8!F8,\"DD-MM-YYYY\"))","v":"21-07-2023"},{"$f":"IF(Sheet8!G8=\"\",\"\",TEXT(Sheet8!G8,\"DD-MM-YYYY\"))","v":"01-07-2023"},{"$f":"IF(Sheet8!H8=\"\",\"\",TEXT(Sheet8!H8,\"DD-MM-YYYY\"))","v":"21-07-2023"},{"$f":"IF(Sheet8!I8=\"\",\"\",Sheet8!I8)","v":{"v":9,"d":"9 izfr'kr"}}]
[{"$f":"IF(OR(OR(OR(B8=\"\",C8=\"\",D8=\"\",E8=\"\"))),\"\",MAX($A$7:A7)+1)","v":""},{"$f":"Sheet8!B9&\"] \"&Sheet8!C9&\"] \"&Sheet8!D9","v":"] ] "},{"$f":"IF(Sheet8!E9=\"\",\"\",TEXT(Sheet8!E9,\"DD-MM-YYYY\"))","v":""},{"$f":"IF(Sheet8!F9=\"\",\"\",TEXT(Sheet8!F9,\"DD-MM-YYYY\"))","v":""},{"$f":"IF(Sheet8!G9=\"\",\"\",TEXT(Sheet8!G9,\"DD-MM-YYYY\"))","v":""},{"$f":"IF(Sheet8!H9=\"\",\"\",TEXT(Sheet8!H9,\"DD-MM-YYYY\"))","v":""},{"$f":"IF(Sheet8!I9=\"\",\"\",Sheet8!I9)","v":""}]
[{"$f":"IF(OR(OR(OR(B9=\"\",C9=\"\",D9=\"\",E9=\"\"))),\"\",MAX($A$7:A8)+1)","v":2},{"$f":"Sheet8!B10&\"] \"&Sheet8!C10&\"] \"&Sheet8!D10","v":"izeksn dqekj lSuh] v/;kid] jk m ek fo ekywrkuk"},{"$f":"IF(Sheet8!E10=\"\",\"\",TEXT(Sheet8!E10,\"DD-MM-YYYY\"))","v":"17-01-2010"},{"$f":"IF(Sheet8!F10=\"\",\"\",TEXT(Sheet8!F10,\"DD-MM-YYYY\"))","v":"17-01-2008"},{"$f":"IF(Sheet8!G10=\"\",\"\",TEXT(Sheet8!G10,\"DD-MM-YYYY\"))","v":"17-01-2010"},{"$f":"IF(Sheet8!H10=\"\",\"\",TEXT(Sheet8!H10,\"DD-MM-YYYY\"))","v":"05-04-2020"},{"$f":"IF(Sheet8!I10=\"\",\"\",Sheet8!I10)","v":{"v":10,"d":"10 izfr'kr"}}]
[{"$f":"IF(OR(OR(OR(B10=\"\",C10=\"\",D10=\"\",E10=\"\"))),\"\",MAX($A$7:A9)+1)","v":""},{"$f":"Sheet8!B11&\"] \"&Sheet8!C11&\"] \"&Sheet8!D11","v":"] ] "},{"$f":"IF(Sheet8!E11=\"\",\"\",TEXT(Sheet8!E11,\"DD-MM-YYYY\"))","v":""},{"$f":"IF(Sheet8!F11=\"\",\"\",TEXT(Sheet8!F11,\"DD-MM-YYYY\"))","v":""},{"$f":"IF(Sheet8!G11=\"\",\"\",TEXT(Sheet8!G11,\"DD-MM-YYYY\"))","v":""},{"$f":"IF(Sheet8!H11=\"\",\"\",TEXT(Sheet8!H11,\"DD-MM-YYYY\"))","v":""},{"$f":"IF(Sheet8!I11=\"\",\"\",Sheet8!I11)","v":""}]
[{"$f":"IF(OR(OR(OR(B11=\"\",C11=\"\",D11=\"\",E11=\"\"))),\"\",MAX($A$7:A10)+1)","v":""},{"$f":"Sheet8!B12&\"] \"&Sheet8!C12&\"] \"&Sheet8!D12","v":"] ] "},{"$f":"IF(Sheet8!E12=\"\",\"\",TEXT(Sheet8!E12,\"DD-MM-YYYY\"))","v":""},{"$f":"IF(Sheet8!F12=\"\",\"\",TEXT(Sheet8!F12,\"DD-MM-YYYY\"))","v":""},{"$f":"IF(Sheet8!G12=\"\",\"\",TEXT(Sheet8!G12,\"DD-MM-YYYY\"))","v":""},{"$f":"IF(Sheet8!H12=\"\",\"\",TEXT(Sheet8!H12,\"DD-MM-YYYY\"))","v":""},{"$f":"IF(Sheet8!I12=\"\",\"\",Sheet8!I12)","v":""}]
[{"$f":"IF(OR(OR(OR(B12=\"\",C12=\"\",D12=\"\",E12=\"\"))),\"\",MAX($A$7:A11)+1)","v":""},{"$f":"Sheet8!B13&\"] \"&Sheet8!C13&\"] \"&Sheet8!D13","v":"] ] "},{"$f":"IF(Sheet8!E13=\"\",\"\",TEXT(Sheet8!E13,\"DD-MM-YYYY\"))","v":""},{"$f":"IF(Sheet8!F13=\"\",\"\",TEXT(Sheet8!F13,\"DD-MM-YYYY\"))","v":""},{"$f":"IF(Sheet8!G13=\"\",\"\",TEXT(Sheet8!G13,\"DD-MM-YYYY\"))","v":""},{"$f":"IF(Sheet8!H13=\"\",\"\",TEXT(Sheet8!H13,\"DD-MM-YYYY\"))","v":""},{"$f":"IF(Sheet8!I13=\"\",\"\",Sheet8!I13)","v":""}]
[{"$f":"IF(OR(OR(OR(B13=\"\",C13=\"\",D13=\"\",E13=\"\"))),\"\",MAX($A$7:A12)+1)","v":""},{"$f":"Sheet8!B14&\"] \"&Sheet8!C14&\"] \"&Sheet8!D14","v":"] ] "},{"$f":"IF(Sheet8!E14=\"\",\"\",TEXT(Sheet8!E14,\"DD-MM-YYYY\"))","v":""},{"$f":"IF(Sheet8!F14=\"\",\"\",TEXT(Sheet8!F14,\"DD-MM-YYYY\"))","v":""},{"$f":"IF(Sheet8!G14=\"\",\"\",TEXT(Sheet8!G14,\"DD-MM-YYYY\"))","v":""},{"$f":"IF(Sheet8!H14=\"\",\"\",TEXT(Sheet8!H14,\"DD-MM-YYYY\"))","v":""},{"$f":"IF(Sheet8!I14=\"\",\"\",Sheet8!I14)","v":""}]
[{"$f":"IF(OR(OR(OR(B14=\"\",C14=\"\",D14=\"\",E14=\"\"))),\"\",MAX($A$7:A13)+1)","v":""},{"$f":"Sheet8!B15&\"] \"&Sheet8!C15&\"] \"&Sheet8!D15","v":"] ] "},{"$f":"IF(Sheet8!E15=\"\",\"\",TEXT(Sheet8!E15,\"DD-MM-YYYY\"))","v":""},{"$f":"IF(Sheet8!F15=\"\",\"\",TEXT(Sheet8!F15,\"DD-MM-YYYY\"))","v":""},{"$f":"IF(Sheet8!G15=\"\",\"\",TEXT(Sheet8!G15,\"DD-MM-YYYY\"))","v":""},{"$f":"IF(Sheet8!H15=\"\",\"\",TEXT(Sheet8!H15,\"DD-MM-YYYY\"))","v":""},{"$f":"IF(Sheet8!I15=\"\",\"\",Sheet8!I15)","v":""}]
[{"$f":"IF(OR(OR(OR(B15=\"\",C15=\"\",D15=\"\",E15=\"\"))),\"\",MAX($A$7:A14)+1)","v":""},{"$f":"Sheet8!B16&\"] \"&Sheet8!C16&\"] \"&Sheet8!D16","v":"] ] "},{"$f":"IF(Sheet8!E16=\"\",\"\",TEXT(Sheet8!E16,\"DD-MM-YYYY\"))","v":""},{"$f":"IF(Sheet8!F16=\"\",\"\",TEXT(Sheet8!F16,\"DD-MM-YYYY\"))","v":""},{"$f":"IF(Sheet8!G16=\"\",\"\",TEXT(Sheet8!G16,\"DD-MM-YYYY\"))","v":""},{"$f":"IF(Sheet8!H16=\"\",\"\",TEXT(Sheet8!H16,\"DD-MM-YYYY\"))","v":""},{"$f":"IF(Sheet8!I16=\"\",\"\",Sheet8!I16)","v":""}]
[{"$f":"IF(OR(OR(OR(B16=\"\",C16=\"\",D16=\"\",E16=\"\"))),\"\",MAX($A$7:A15)+1)","v":""},{"$f":"Sheet8!B17&\"] \"&Sheet8!C17&\"] \"&Sheet8!D17","v":"] ] "},{"$f":"IF(Sheet8!E17=\"\",\"\",TEXT(Sheet8!E17,\"DD-MM-YYYY\"))","v":""},{"$f":"IF(Sheet8!F17=\"\",\"\",TEXT(Sheet8!F17,\"DD-MM-YYYY\"))","v":""},{"$f":"IF(Sheet8!G17=\"\",\"\",TEXT(Sheet8!G17,\"DD-MM-YYYY\"))","v":""},{"$f":"IF(Sheet8!H17=\"\",\"\",TEXT(Sheet8!H17,\"DD-MM-YYYY\"))","v":""},{"$f":"IF(Sheet8!I17=\"\",\"\",Sheet8!I17)","v":""}]
[]
[{"$nulls":4},"gLrk{kj MhMhvks e; in eqgj"]
["izfrfyfi fuEu dks lwpukFkZ ,oa vko’;d dk;Zokgh gsrq iszf\"kr gSA"]
["1- Jheku~ midks\"kkf/kdkjh] midks\"k dk;kZy;-------------------A"]
["2- ys[kk 'kk[kk] LFkkuh; dk;kZy;A"]
["3- lacaf/k deZpkjh-------------A"]
[]
[{"$nulls":4},"gLrk{kj MhMhvks e; in eqgj"]

{"sheet":"Sheet10","index":9,"n_rows":17,"n_cols":8,"rows_kept":17,"merged":[[0,0,0,7],[1,0,1,7],[2,0,2,7],[3,0,3,7],[4,0,4,7],[5,0,5,7]]}
["vkgj.k ,oa forj.k vf/kdkjh dk;kZy;↓"]
["jktdh; mPp ek/;fed fon~;ky; ekywrkuk ¼Fkkukxkth½ vyoj"]
["Lohd`rh vkns'k Øekad↓"]
[1500]
["Lohd`rh vkns'k fnukad↓"]
["2023-07-15"]
["Ø- la-","uke deZpkjh","in uke","inLFkkiu LFkku","lsokfuo`fÙk fnukad","'ks\"k tek mikftZr vodk'k","vafre izkIr ewy osru","vafre izkIr Mh-,- nj"]
[1,"izeksn dqekj lSuh","v/;kid","jk m ek fo ekywrkuk","2042-07-31",300,145000,50]
[2]
[3]
[4]
[5]
[6]
[7]
[8]
[9]
[10]

{"sheet":"Sheet11","index":10,"n_rows":27,"n_cols":7,"rows_kept":27,"merged":[[0,0,0,6],[3,0,3,6],[4,0,4,6],[5,0,6,0],[5,1,6,1],[5,2,6,2],[5,3,6,3],[5,4,5,6],[18,4,18,6],[26,4,26,6]]}
[{"$f":"\"dk;kZy; \"&Sheet10!A2","v":"dk;kZy; jktdh; mPp ek/;fed fon~;ky; ekywrkuk ¼Fkkukxkth½ vyoj"}]
[{"$f":"\"dzekad % \"&Sheet10!A4","v":"dzekad % 1500"},{"$nulls":5},{"$f":"\"fnukad % \"&IF(Sheet10!A6=\"\",\"\",TEXT(Sheet10!A6,\"DD-MM-YYYY\"))","v":"fnukad % 15-07-2023"}]
[]
["dk;kZy; vkns'k"]
["     bl dk;kZy; ds fuEu deZpkfj;ksa@deZpkjh dh jkT; lsok esa vf/kokf\"kZdh vk;q iw.kZ gksus ij muds uke ds laeq[k vafdr fnukad dks lsokfuo`fÙk gksus dss QyLo#i deZpkfj;ksa@deZpkjh dh lsok iqfLrdk ds vodk'k [kkrs esa 'ks\"k tek mikftZr vodk'k ds LoRo ds vodk'k osru esa udn Hkqxrku dh jktLFkku lsok fu;e 91&ch ds izko/kku vuqlkj ,rn~ }kjk Lohd`fr iznku dh tkrh gSaA\n     udn Hkqxrku ds mikftZr vodk'k LoRo dh izfof\"V deZpkjh ds vodk'k ys[kk esa dh tkdj mikftZr vodk'k LoRo 'kwU; dj fn;k x;k gSaA\n     bldk Hkqxrku ctV gSM 2071&01&115&01&01 jkT; fuf/k ls fd;k tkosA\n"]
["dz- la-","uke deZpkjh] in uke ,oa inLFkkiu LFkku","lsokfuo`fÙk fnukad","'ks\"k tek mikftZr vodk'k","udn Hkqxrku jkf'k"]
[{"$nulls":4},"ewy osru","Mh- ,-",";ksx"]
[{"$f":"IF(OR(OR(OR(B8=\"\",C8=\"\",D8=\"\",E8=\"\"))),\"\",1)","v":1},{"$f":"Sheet10!B8&\"] \"&Sheet10!C8&\"] \"&Sheet10!D8","v":"izeksn dqekj lSuh] v/;kid] jk m ek fo ekywrkuk"},{"$f":"IF(Sheet10!E8=\"\",\"\",TEXT(Sheet10!E8,\"DD-MM-YYYY\"))","v":"31-07-2042"},{"$f":"MIN(IF(C8=\"\",\"\",Sheet10!F8),300)","v":300},{"$f":"IF(D8=\"\",\"\",ROUND((D8/30)*Sheet10!G8,0))","v":1450000},{"$f":"IF(E8=\"\",\"\",ROUND(E8*Sheet10!H8/100,0))","v":725000},{"$f":"IF(F8=\"\",\"\",E8+F8)","v":2175000}]
[{"$f":"IF(OR(OR(OR(B9=\"\",C9=\"\",D9=\"\",E9=\"\"))),\"\",MAX($A$8:A8)+1)","v":""},{"$f":"Sheet10!B9&\"] \"&Sheet10!C9&\"] \"&Sheet10!D9","v":"] ] "},{"$f":"IF(Sheet10!E9=\"\",\"\",TEXT(Sheet10!E9,\"DD-MM-YYYY\"))","v":""},{"$f":"IF(C9=\"\",\"\",Sheet10!F9)","v":""},{"$f":"IF(D9=\"\",\"\",ROUND((D9/30)*Sheet10!G9,0))","v":""},{"$f":"IF(E9=\"\",\"\",ROUND(E9*Sheet10!H9/100,0))","v":""},{"$f":"IF(F9=\"\",\"\",E9+F9)","v":""}]
[{"$f":"IF(OR(OR(OR(B10=\"\",C10=\"\",D10=\"\",E10=\"\"))),\"\",MAX($A$8:A9)+1)","v":""},{"$f":"Sheet10!B10&\"] \"&Sheet10!C10&\"] \"&Sheet10!D10","v":"] ] "},{"$f":"IF(Sheet10!E10=\"\",\"\",TEXT(Sheet10!E10,\"DD-MM-YYYY\"))","v":""},{"$f":"IF(C10=\"\",\"\",Sheet10!F10)","v":""},{"$f":"IF(D10=\"\",\"\",ROUND((D10/30)*Sheet10!G10,0))","v":""},{"$f":"IF(E10=\"\",\"\",ROUND(E10*Sheet10!H10/100,0))","v":""},""]
[{"$f":"IF(OR(OR(OR(B11=\"\",C11=\"\",D11=\"\",E11=\"\"))),\"\",MAX($A$8:A10)+1)","v":""},{"$f":"Sheet10!B11&\"] \"&Sheet10!C11&\"] \"&Sheet10!D11","v":"] ] "},{"$f":"IF(Sheet10!E11=\"\",\"\",TEXT(Sheet10!E11,\"DD-MM-YYYY\"))","v":""},{"$f":"IF(C11=\"\",\"\",Sheet10!F11)","v":""},{"$f":"IF(D11=\"\",\"\",ROUND((D11/30)*Sheet10!G11,0))","v":""},{"$f":"IF(E11=\"\",\"\",ROUND(E11*Sheet10!H11/100,0))","v":""},""]
[{"$f":"IF(OR(OR(OR(B12=\"\",C12=\"\",D12=\"\",E12=\"\"))),\"\",MAX($A$8:A11)+1)","v":""},{"$f":"Sheet10!B12&\"] \"&Sheet10!C12&\"] \"&Sheet10!D12","v":"] ] "},{"$f":"IF(Sheet10!E12=\"\",\"\",TEXT(Sheet10!E12,\"DD-MM-YYYY\"))","v":""},{"$f":"IF(C12=\"\",\"\",Sheet10!F12)","v":""},{"$f":"IF(D12=\"\",\"\",ROUND((D12/30)*Sheet10!G12,0))","v":""},{"$f":"IF(E12=\"\",\"\",ROUND(E12*Sheet10!H12/100,0))","v":""},""]
[{"$f":"IF(OR(OR(OR(B13=\"\",C13=\"\",D13=\"\",E13=\"\"))),\"\",MAX($A$8:A12)+1)","v":""},{"$f":"Sheet10!B13&\"] \"&Sheet10!C13&\"] \"&Sheet10!D13","v":"] ] "},{"$f":"IF(Sheet10!E13=\"\",\"\",TEXT(Sheet10!E13,\"DD-MM-YYYY\"))","v":""},{"$f":"IF(C13=\"\",\"\",Sheet10!F13)","v":""},{"$f":"IF(D13=\"\",\"\",ROUND((D13/30)*Sheet10!G13,0))","v":""},{"$f":"IF(E13=\"\",\"\",ROUND(E13*Sheet10!H13/100,0))","v":""},""]
[{"$f":"IF(OR(OR(OR(B14=\"\",C14=\"\",D14=\"\",E14=\"\"))),\"\",MAX($A$8:A13)+1)","v":""},{"$f":"Sheet10!B14&\"] \"&Sheet10!C14&\"] \"&Sheet10!D14","v":"] ] "},{"$f":"IF(Sheet10!E14=\"\",\"\",TEXT(Sheet10!E14,\"DD-MM-YYYY\"))","v":""},{"$f":"IF(C14=\"\",\"\",Sheet10!F14)","v":""},{"$f":"IF(D14=\"\",\"\",ROUND((D14/30)*Sheet10!G14,0))","v":""},{"$f":"IF(E14=\"\",\"\",ROUND(E14*Sheet10!H14/100,0))","v":""},""]
[{"$f":"IF(OR(OR(OR(B15=\"\",C15=\"\",D15=\"\",E15=\"\"))),\"\",MAX($A$8:A14)+1)","v":""},{"$f":"Sheet10!B15&\"] \"&Sheet10!C15&\"] \"&Sheet10!D15","v":"] ] "},{"$f":"IF(Sheet10!E15=\"\",\"\",TEXT(Sheet10!E15,\"DD-MM-YYYY\"))","v":""},{"$f":"IF(C15=\"\",\"\",Sheet10!F15)","v":""},{"$f":"IF(D15=\"\",\"\",ROUND((D15/30)*Sheet10!G15,0))","v":""},{"$f":"IF(E15=\"\",\"\",ROUND(E15*Sheet10!H15/100,0))","v":""},""]
[{"$f":"IF(OR(OR(OR(B16=\"\",C16=\"\",D16=\"\",E16=\"\"))),\"\",MAX($A$8:A15)+1)","v":""},{"$f":"Sheet10!B16&\"] \"&Sheet10!C16&\"] \"&Sheet10!D16","v":"] ] "},{"$f":"IF(Sheet10!E16=\"\",\"\",TEXT(Sheet10!E16,\"DD-MM-YYYY\"))","v":""},{"$f":"IF(C16=\"\",\"\",Sheet10!F16)","v":""},{"$f":"IF(D16=\"\",\"\",ROUND((D16/30)*Sheet10!G16,0))","v":""},{"$f":"IF(E16=\"\",\"\",ROUND(E16*Sheet10!H16/100,0))","v":""},""]
[{"$f":"IF(OR(OR(OR(B17=\"\",C17=\"\",D17=\"\",E17=\"\"))),\"\",MAX($A$8:A16)+1)","v":""},{"$f":"Sheet10!B17&\"] \"&Sheet10!C17&\"] \"&Sheet10!D17","v":"] ] "},{"$f":"IF(Sheet10!E17=\"\",\"\",TEXT(Sheet10!E17,\"DD-MM-YYYY\"))","v":""},{"$f":"IF(C17=\"\",\"\",Sheet10!F17)","v":""},{"$f":"IF(D17=\"\",\"\",ROUND((D17/30)*Sheet10!G17,0))","v":""},{"$f":"IF(E17=\"\",\"\",ROUND(E17*Sheet10!H17/100,0))","v":""},""]
[]
[{"$nulls":4},"gLrk{kj MhMhvks e; in eqgj"]
["izfrfyfi fuEu dks lwpukFkZ ,oa vko’;d dk;Zokgh gsrq iszf\"kr gSA"]
["1- Jheku~ dks\"kkf/kdkjh@midks\"kkf/kdkjh -----A"]
["2- ys[kk 'kk[kk] LFkkuh; dk;kZy;A"]
["3- lacf/kr deZpkjh -----A"]
[]
[]
[]
[{"$nulls":4},"gLrk{kj MhMhvks e; in eqgj"]

{"sheet":"Sheet12","index":11,"n_rows":16,"n_cols":19,"rows_kept":16}
["dz-la-","dk;kZy; izeq[k","dk;kZy; uke","dk;kZy; irk","dkfeZd uke","in uke","inLFkkiu LFkku","izFke fu;qfDr fnukad","ns; ,e,lhih","ns; ,e,lhih fnukad","vkns'k tkjhdrkZ dk;kZy;","vkns'k dzekad","vkns'k fnukad",",e,lhih ls iwoZ is&ysoy",",e,lhih ls iwoZ ewy osru",",e,lhih ls Ik'pkr~ is&ysoy","tkjh vkns'k dzekad","tkjh vkns'k fnukad"]
[1,"iz/kkukpk;Z","jktdh; mPp ek/;fed fon~;ky;","ekywrkuk ¼Fkkukxkth½ vyoj","izeksn dqekj lSuh","v/;kid","jk m ek fo ekywrkuk","2008-01-17","9 o\"khZ; izFke","2017-01-17","ftyk f'k{kk vf/kdkjh] izkjafHkd f'k{kk] vyoj","ftf'kv@vy@izkf'k@Qk&,ihih@2019@1507","2019-01-17",12,40300,13,1201,"2019-02-21","9 o\"khZ; izFke"]
[2,"iz/kkukpk;Z","jktdh; mPp ek/;fed fon~;ky;","ekywrkuk ¼Fkkukxkth½ vyoj","dkfeZd","v/;kid","jk m ek fo ekywrkuk","2005-04-21","18 o\"khZ; f}rh;","2023-04-21","ftyk f'k{kk vf/kdkjh ¼eq[;ky;½] ek/;fed f'k{kk] vyoj","ftf'kv@eq-ek-@vy@laLFkk&3@Qk&,lhih&v/;k- ,oa led{k@2023@245","2023-06-08",11,55500,12,1201,"2023-07-01","18 o\"khZ; f}rh;"]
[3,"iz/kkukpk;Z","jktdh; mPp ek/;fed fon~;ky;","ekywrkuk ¼Fkkukxkth½ vyoj","deZpkjh","ofj- v/;kid","jk m ek fo ekywrkuk","2014-12-31","9 o\"khZ; izFke","2023-12-31","la;qDr funs’kd] Ldwy f’k{kk] t;iqj laHkkx] t;iqj","lafu@Ldwy-f’k{kk@t;@laLFkk&5@,Q&501@,e,lhih@2024@28","2024-06-19",11,46500,12,1352,"2024-06-21","27 o\"khZ; r`rh;"]
[4,"iz/kkukpk;Z","jktdh; mPp ek/;fed fon~;ky;","ekywrkuk ¼Fkkukxkth½ vyoj","dksbZ ","v/;kid ysoy&1","jk m ek fo ekywrkuk","23-03-2015 After Noon","9 o\"khZ; izFke","2024-03-24","ftyk f'k{kk vf/kdkjh ¼eq[;ky;½] izkjafHkd f'k{kk] vyoj","ftf'kv@eqizkf'k@vy@laLFkk&3@Qk&03 vkWuykbZu ,lhih@2024&25@881","2024-06-24",10,41500,11,1353,"2024-06-23"]
[5,"iz/kkukpk;Z","jktdh; mPp ek/;fed fon~;ky;","ekywrkuk ¼Fkkukxkth½ vyoj","jke jke lk","v/;kid ysoy&1","egkRek xkW/kh jk fo Mgjk","Actual \n28-10-2017     \n\nNotional \n08-04-2015\n","9 o\"khZ; izFke","2024-04-08","ftyk f'k{kk vf/kdkjh ¼eq[;ky;½] izkjafHkd f'k{kk] vyoj","ftf'kv@eqizkf'k@vy@laLFkk&3@Qk&03 vkWuykbZu ,lhih@2024&25@452","2024-09-23",10,41500,11,null,"2024-10-14"]
[6]
[7]
[8]
[9]
[10]
[11]
[12]
[13]
[14]
[15]

{"sheet":"Sheet13","index":12,"n_rows":46,"n_cols":33,"rows_kept":46,"merged":[[0,0,0,6],[0,8,0,32],[1,9,1,17],[1,18,1,21],[1,22,1,29],[1,30,1,32],[2,0,2,6],[3,0,8,6],[9,0,9,1],[9,2,9,4],[10,0,10,1],[10,2,10,4],[11,0,11,1],[11,2,11,4],[12,0,12,1],[12,2,12,4],[13,0,13,1],[13,2,13,4],[14,0,14,2],[14,3,14,5],[14,6,15,6],[18,5,18,6],[19,5,19,6],[20,5,20,6],[27,5,27,6],[28,5,28,6],[29,5,29,6]]}
[{"$f":"\"dk;kZy; \"&VLOOKUP($G$10,acp_data,2,0)&\"] \"&VLOOKUP($G$10,acp_data,3,0)&\"] \"&VLOOKUP($G$10,acp_data,4,0)","v":"dk;kZy; iz/kkukpk;Z] jktdh; mPp ek/;fed fon~;ky;] ekywrkuk ¼Fkkukxkth½ vyoj"},{"$nulls":7},"SCHEDULE-I PART-B RULE NO 5 vi &vii PAY MATRIX OF RAJASTHAN GOVT SERVANTS"]
[{"$f":"\"Øekad % \"&IFERROR(VLOOKUP($G$10,acp_data,17,0),\"\")","v":"Øekad % 1353"},{"$nulls":5},{"$f":"\"fnukad % \"&IFERROR(TEXT(VLOOKUP($G$10,acp_data,18,0),\"DD-MM-YYYY\"),\"\")","v":"fnukad % 23-06-2024"},null,"Exist. R.P.Band","PB-1 [5200-20200]",{"$nulls":8},"PB-2 [9300-34800]",{"$nulls":3},"PB-3 [15600-39100]",{"$nulls":7},"PB-4 [37400-67000]"]
["%% dk;kZy; vkns'k %%",{"$nulls":7},"Exist. G.P.",1700,1750,1900,2000,2400,2400,2400,2800,2800,3600,4200,4800,5400,5400,6000,6600,6800,7200,7600,8200,8700,8900,9500,10000]
[{"$f":"\"     Jheku~ \"&IFERROR(VLOOKUP($G$10,acp_data,11,0),\"\")&\" ds vkns'k dzekad \"&IFERROR(VLOOKUP($G$10,acp_data,12,0),\"\")&\" fnukad \"&TEXT(IFERROR(VLOOKUP($G$10,acp_data,13,0),\"\"),\"DD-MM-YYYY\")&\" dh vuqikyuk esa jktLFkku flfoy lsok ¼iqujhf{kr osrueku½ fu;e] 2017 ds fu;e 14 esa la’kks/ku fd;s tkus ij dk;kZy; ds fuEu dkfeZd ds }kjk \"&IFERROR(VLOOKUP($G$10,acp_data,9,0),\"\")&\" lsok iw.kZ djus ij la’kksf/kr vk’okflr dSfj;j izxfr Lohd`r fd;s tkus ij foÙk foHkkx dh vf/klwpuk dzekad ,Q-15¼1½ foÙk@fu;e@2017 ikVZ 2 fnukad 06-10-2023 ds vuqlkj fuEukuqlkj osru fu/kkZfjr dj ,rn~ }kjk Hkqxrku dh Lohd`fr iznku dh tkrh gSA\"&\" bUgsa fu;ekuqlkj ,e-,-lh-ih- Lohd`fr fnukad ls ,fj;lZ Hkqxrku dh Lohd`fr Hkh ,rn~ }kjk iznku dh tkrh gSA\"","v":"     Jheku~ ftyk f'k{kk vf/kdkjh ¼eq[;ky;½] izkjafHkd f'k{kk] vyoj ds vkns'k dzekad ftf'kv@eqizkf'k@vy@laLFkk&3@Qk&03 vkWuykbZu ,lhih@2024&25@881 fnukad 24-06-2024 dh vuqikyuk esa jktLFkku flfoy lsok ¼iqujhf{kr osrueku½ fu;e] 2017 ds fu;e 14 esa la’kks/ku fd;s tkus ij dk;kZy; ds fuEu dkfeZd ds }kjk 9 o\"khZ; izFke lsok iw.kZ djus ij la’kksf/kr vk’okflr dSfj;j izxfr Lohd`r fd;s tkus ij foÙk foHkkx dh vf/klwpuk dzekad ,Q-15¼1½ foÙk@fu;e@2017 ikVZ 2 fnukad 06-10-2023 ds vuqlkj fuEukuqlkj osru fu/kkZfjr dj ,rn~ }kjk Hkqxrku dh Lohd`fr iznku dh tkrh gSA bUgsa fu;ekuqlkj ,e-,-lh-ih- Lohd`fr fnukad ls ,fj;lZ Hkqxrku dh Lohd`fr Hkh ,rn~ }kjk iznku dh tkrh gSA"},{"$nulls":7},"Exist. G.P.No.",2,3,4,5,9,"9A","9B",10,"10A",11,12,14,15,15,16,17,18,19,20,21,22,23,"23A",24]
[{"$nulls":8},"Level",{"v":1,"d":"L-1"},{"v":2,"d":"L-2"},{"v":3,"d":"L-3"},{"v":4,"d":"L-4"},{"v":5,"d":"L-5"},{"v":6,"d":"L-6"},{"v":7,"d":"L-7"},{"v":8,"d":"L-8"},{"v":9,"d":"L-9"},{"v":10,"d":"L-10"},{"v":11,"d":"L-11"},{"v":12,"d":"L-12"},{"v":13,"d":"L-13"},{"v":14,"d":"L-14"},{"v":15,"d":"L-15"},{"v":16,"d":"L-16"},{"v":17,"d":"L-17"},{"v":18,"d":"L-18"},{"v":19,"d":"L-19"},{"v":20,"d":"L-20"},{"v":21,"d":"L-21"},{"v":22,"d":"L-22"},{"v":23,"d":"L-23"},{"v":24,"d":"L-24"}]
[{"$nulls":8},1,17700,17900,18200,19200,20800,21500,22400,26300,28700,33800,37800,44300,53100,56100,60700,67300,71000,75300,79900,88900,123100,129700,145800,148800]
[{"$nulls":8},2,18200,18400,18700,19800,21400,22100,23100,27100,29600,34800,38900,45600,54700,57800,62500,69300,73100,77600,82300,91600,126800,133600,150200,153300]
[{"$nulls":8},3,18700,19000,19300,20400,22000,22800,23800,27900,30500,35800,40100,47000,56300,59500,64400,71400,75300,79900,84800,94300,130600,137600,154700,157900]
[{"$nulls":8},4,19300,19600,19900,21000,22700,23500,24500,28700,31400,36900,41300,48400,58000,61300,66300,73500,77600,82300,87300,97100,134500,141700,159300,162600]
["uke dkfeZd %",null,{"$f":"IFERROR(VLOOKUP($G$10,acp_data,5,0),\"\")","v":"dksbZ "},{"$nulls":3},4,null,5,19900,20200,20500,21600,23400,24200,25200,29600,32300,38000,42500,49900,59700,63100,68300,75700,79900,84800,89900,100000,138500,146000,164100,167500]
["orZeku /kkfjr in %",null,{"$f":"IFERROR(VLOOKUP($G$10,acp_data,6,0),\"\")","v":"v/;kid ysoy&1"},{"$nulls":5},6,20500,20800,21100,22200,24100,24900,26000,30500,33300,39100,43800,51400,61500,65000,70300,78000,82300,87300,92600,103000,142700,150400,169000,172500]
["inLFkkiu LFkku %",null,{"$f":"IFERROR(VLOOKUP($G$10,acp_data,7,0),\"\")","v":"jk m ek fo ekywrkuk"},{"$nulls":5},7,21100,21400,21700,22900,24800,25600,26800,31400,34300,40300,45100,52900,63300,67000,72400,80300,84800,89900,95400,106100,147000,154900,174100,177700]
["izFke fu;qfDr fnukad %",null,{"$f":"TEXT(IFERROR(VLOOKUP($G$10,acp_data,8,0),\"\"),\"DD-MM-YYYY\")","v":"23-03-2015 After Noon"},{"$nulls":5},8,21700,22000,22400,23600,25500,26400,27600,32300,35300,41500,46500,54500,65200,69000,74600,82700,87300,92600,98300,109300,151400,159500,179300,183000]
[",e-,-lh-ih- ns; fnukad %",null,{"$f":"TEXT(IFERROR(VLOOKUP($G$10,acp_data,10,0),\"\"),\"DD-MM-YYYY\")","v":"24-03-2024"},{"$nulls":5},9,22400,22700,23100,24300,26300,27200,28400,33300,36400,42700,47900,56100,67200,71100,76800,85200,89900,95400,101200,112600,155900,164300,184700,188500]
[{"$f":"\",e,lhih Lohd`rh fnukad \"&C14& \" iwoZ osru\"","v":",e,lhih Lohd`rh fnukad 24-03-2024 iwoZ osru"},null,null,{"$f":"\",e,lhih Lohd`rh fnukad \"&C14& \" i’pkr~ osru\"","v":",e,lhih Lohd`rh fnukad 24-03-2024 i’pkr~ osru"},null,null,"vkxkeh osru o`f) fnukad",null,10,23100,23400,23800,25000,27100,28000,29300,34300,37500,44000,49300,57800,69200,73200,79100,87800,92600,98300,104200,116000,160600,169200,190200,194200]
["is&cSaM","is&ysoy"," osru","is&cSaM","is&ysoy"," osru",null,null,11,23800,24100,24500,25800,27900,28800,30200,35300,38600,45300,50800,59500,71300,75400,81500,90400,95400,101200,107300,119500,165400,174300,195900,200000]
[{"$f":"IF(AND(B17>0,B17<10),\"PB-1\",IF(AND(B17>9,B17<14),\"PB-2\",IF(AND(B17>13,B17<22),\"PB-3\",IF(AND(B17>21,B17<25),\"PB-4\",\"\"))))","v":"PB-2"},{"$f":"IFERROR(VLOOKUP($G$10,acp_data,14,0),\"\")","v":10},{"$f":"IFERROR(VLOOKUP($G$10,acp_data,15,0),\"\")","v":41500},{"$f":"IF(AND(E17>0,E16<10),\"PB-1\",IF(AND(E17>9,E17<14),\"PB-2\",IF(AND(E17>13,E17<22),\"PB-3\",IF(AND(E17>21,E17<25),\"PB-4\",\"\"))))","v":"PB-2"},{"$f":"IFERROR(VLOOKUP($G$10,acp_data,16,0),\"\")","v":11},{"$f":"SUM(J46:AG46)","v":43800},{"$f":"IFERROR(IF(MONTH(C14)<7,\"01-07-\"&YEAR(C14),\"01-07-\"&YEAR(C14)+1),\"\")","v":"01-07-2024"},null,12,24500,24800,25200,26600,28700,29700,31100,36400,39800,46700,52300,61300,73400,77700,83900,93100,98300,104200,110500,123100,170400,179500,201800,206000]
[{"$nulls":8},13,25200,25500,26000,27400,29600,30600,32000,37500,41000,48100,53900,63100,75600,80000,86400,95900,101200,107300,113800,126800,175500,184900,207900,212200]
[{"$nulls":5},{"$f":"IFERROR(VLOOKUP($G$10,acp_data,2,0),\"\")","v":"iz/kkukpk;Z"},null,null,14,26000,26300,26800,28200,30500,31500,33000,38600,42200,49500,55500,65000,77900,82400,89000,98800,104200,110500,117200,130600,180800,190400,214100,218600]
[{"$nulls":5},{"$f":"IFERROR(VLOOKUP($G$10,acp_data,3,0),\"\")","v":"jktdh; mPp ek/;fed fon~;ky;"},null,null,15,26800,27100,27600,29000,31400,32400,34000,39800,43500,51000,57200,67000,80200,84900,91700,101800,107300,113800,120700,134500,186200,196100]
[{"$nulls":5},{"$f":"IFERROR(VLOOKUP($G$10,acp_data,4,0),\"\")","v":"ekywrkuk ¼Fkkukxkth½ vyoj"},null,null,16,27600,27900,28400,29900,32300,33400,35000,41000,44800,52500,58900,69000,82600,87400,94500,104900,110500,117200,124300,138500,191800,202000]
["izfrfyfi fuEu dks lwpukFkZ ,oa vko’;d dk;Zokgh gsrq iszf\"kr gSA",{"$nulls":7},17,28400,28700,29300,30800,33300,34400,36100,42200,46100,54100,60700,71100,85100,90000,97300,108000,113800,120700,128000,142700,197600,208100]
[{"$f":"\"1- Jheku~ \"&IFERROR(VLOOKUP($G$10,acp_data,11,0),\"\")&\"A\"","v":"1- Jheku~ ftyk f'k{kk vf/kdkjh ¼eq[;ky;½] izkjafHkd f'k{kk] vyojA"},{"$nulls":7},18,29300,29600,30200,31700,34300,35400,37200,43500,47500,55700,62500,73200,87700,92700,100200,111200,117200,124300,131800,147000,203500]
["2- Jheku~ dks\"kkf/kdkjh@mi dks\"kkf/kdkjh ------------------------------A",{"$nulls":7},19,30200,30500,31100,32700,35300,36500,38300,44800,48900,57400,64400,75400,90300,95500,103200,114500,120700,128000,135800,151400]
["3- ys[kk 'kk[kk] LFkkuh; dk;kZy;A",{"$nulls":7},20,31100,31400,32000,33700,36400,37600,39400,46100,50400,59100,66300,77700,93000,98400,106300,117900,124300,131800,139900,155900]
[{"$f":"\"4- lacaf/kr dkfeZd % \"&C10&\"] \"&C11&\"A\"","v":"4- lacaf/kr dkfeZd % dksbZ ] v/;kid ysoy&1A"},{"$nulls":7},21,32000,32300,33000,34700,37500,38700,40600,47500,51900,60900,68300,80000,95800,101400,109500,121400,128000,135800,144100,160600]
[{"$nulls":8},22,33000,33300,34000,35700,38600,39900,41800,48900,53500,62700,70300,82400,98700,104400,112800,125000,131800,139900,148400,165400]
[{"$nulls":5},{"$f":"F19","v":"iz/kkukpk;Z"},null,null,23,34000,34300,35000,36800,39800,41100,43100,50400,55100,64600,72400,84900,101700,107500,116200,128800,135800,144100,152900,170400]
[{"$nulls":5},{"$f":"F20","v":"jktdh; mPp ek/;fed fon~;ky;"},null,null,24,35000,35300,36100,37900,41000,42300,44400,51900,56800,66500,74600,87400,104800,110700,119700,132700,139900,148400,157500,175500]
[{"$nulls":5},{"$f":"F21","v":"ekywrkuk ¼Fkkukxkth½ vyoj"},null,null,25,36100,36400,37200,39000,42200,43600,45700,53500,58500,68500,76800,90000,107900,114000,123300,136700,144100,152900,162200,180800]
[{"$nulls":8},26,37200,37500,38300,40200,43500,44900,47100,55100,60300,70600,79100,92700,111100,117400,127000,140800,148400,157500,167100,186200]
[{"$nulls":8},27,38300,38600,39400,41400,44800,46200,48500,56800,62100,72700,81500,95500,114400,120900,130800,145000,152900,162200,172100,191800]
[{"$nulls":8},28,39400,39800,40600,42600,46100,47600,50000,58500,64000,74900,83900,98400,117800,124500,134700,149400,157500,167100,177300,197600]
[{"$nulls":8},29,40600,41000,41800,43900,47500,49000,51500,60300,65900,77100,86400,101400,121300,128200,138700,153900,162200,172100,182600,203500]
[{"$nulls":8},30,41800,42200,43100,45200,48900,50500,53000,62100,67900,79400,89000,104400,124900,132000,142900,158500,167100,177300,188100]
[{"$nulls":8},31,43100,43500,44400,46600,50400,52000,54600,64000,69900,81800,91700,107500,128600,136000,147200,163300,172100,182600,193700]
[{"$nulls":8},32,44400,44800,45700,48000,51900,53600,56200,65900,72000,84300,94500,110700,132500,140100,151600,168200,177300,188100,199500]
[{"$nulls":8},33,45700,46100,47100,49400,53500,55200,57900,67900,74200,86800,97300,114000,136500,144300,156100,173200,182600,193700]
[{"$nulls":8},34,47100,47500,48500,50900,55100,56900,59600,69900,76400,89400,100200,117400,140600,148600,160800,178400,188100,199500]
[{"$nulls":8},35,48500,48900,50000,52400,56800,58600,61400,72000,78700,92100,103200,120900,144800,153100,165600,183800,193700]
[{"$nulls":8},36,50000,50400,51500,54000,58500,60400,63200,74200,81100,94900,106300,124500,149100,157700,170600,189300,199500]
[{"$nulls":8},37,51500,51900,53000,55600,60300,62200,65100,76400,83500,97700,109500,128200,153600,162400,175700,195000]
[{"$nulls":8},38,53000,53500,54600,57300,62100,64100,67100,78700,86000,100600,112800,132000,158200,167300,181000]
[{"$nulls":8},39,54600,55100,56200,59000,64000,66000,69100,81100,88600,103600,116200,136000,162900,172300,186400]
[{"$nulls":8},40,56200,56800,57900,60800,65900,68000,71200,83500,91300,106700,119700,140100,167800,177500,192000]
[{"$nulls":9},{"$f":"IF($E$17=J5,INDEX(J6:J45,MATCH(TRUE,INDEX(J6:J45>MROUND($C$17*103%,100),0),0)))","v":false},false,false,false,false,false,false,false,false,false,43800,false,false,false,false,false,false,false,false,false,false,false,false,false]

{"sheet":"Sheet14","index":13,"n_rows":24,"n_cols":7,"rows_kept":24,"merged":[[0,0,0,6],[1,0,1,6],[2,0,2,6],[3,0,3,6],[4,0,4,6],[5,0,5,6],[6,0,6,6],[7,0,7,6],[8,0,8,6],[9,0,9,6],[10,0,10,6],[11,0,11,6],[12,0,13,0],[12,1,13,1],[12,2,13,2],[12,3,13,3],[12,4,13,4],[12,5,12,6]]}
["vkgj.k ,oa forj.k vf/kdkjh dk;kZy;↓"]
["jktdh; mPp ek/;fed fon~;ky; ekywrkuk ¼Fkkukxkth½ vyoj"]
["Lohd`fr vkns'k dzekad↓"]
[2012]
["Lohd`fr vkns'k fnukad↓"]
["2023-10-14"]
["deZpkjh dk uke↓"]
["izeksn dqekj lSuh"]
["in uke↓"]
["v/;kid"]
["inLFkkiu LFkku↓"]
["jktdh; mPp ek/;fed fon~;ky; ekywrkuk ¼Fkkukxkth½ vyoj"]
["Ø- la-","vkns'k tkjhdrkZ vf/kdkjh@dk;kZy;","vkns'k dzekad","vkns'k fnukad","dk;Z fooj.k","dk;Z vof/k"]
[{"$nulls":5},"ls","rd"]
[1,",lMh,e",2012,"2023-04-05","vjh","2023-12-01","2023-12-13"]
[2,",lMh,e",2013,"2023-04-06","vjh","2023-12-02","2023-12-14"]
[3,",lMh,e",2014,"2023-04-07","vjh","2023-12-03","2023-12-15"]
[4,",lMh,e",2015,"2023-04-08","vjh","2023-12-04","2023-12-16"]
[5,",lMh,e",2016,"2023-04-09","vjh","2023-12-05","2023-12-17"]
[6,",lMh,e",2017,"2023-04-10","vjh","2023-12-06","2023-12-18"]
[7,",lMh,e",2018,"2023-04-11","vjh","2023-12-07","2023-12-19"]
[8,",lMh,e",2019,"2023-04-12","vjh","2023-12-08","2023-12-20"]
[9,",lMh,e",2020,"2023-04-13","vjh","2023-12-09","2023-12-21"]
[10,",lMh,e",2021,"2023-04-14","vjh","2023-12-10","2023-12-22"]

{"sheet":"Sheet15","index":14,"n_rows":25,"n_cols":9,"rows_kept":25,"merged":[[0,0,0,8],[3,0,3,8],[4,0,4,8],[5,0,6,0],[5,1,6,1],[5,2,6,2],[5,3,6,3],[5,4,6,4],[5,5,5,7],[5,8,6,8],[18,5,18,7],[24,5,24,7]]}
[{"$f":"\"dk;kZy; \"&Sheet14!A2","v":"dk;kZy; jktdh; mPp ek/;fed fon~;ky; ekywrkuk ¼Fkkukxkth½ vyoj"}]
[{"$f":"\"dzekad % \"&Sheet14!A4","v":"dzekad % 2012"},{"$nulls":7},{"$f":"\"fnukad % \"&IF(Sheet14!A6=\"\",\"\",TEXT(Sheet14!A6,\"DD-MM-YYYY\"))","v":"fnukad % 14-10-2023"}]
[]
["dk;kZy; vkns'k"]
[{"$f":"\"     bl dk;kZy; ds deZpkjh Jh \"&Sheet14!A8&\"] \"&Sheet14!A10&\"] \"&Sheet14!A12&\" ds }kjk fofHkUUk vodk'k vof/k;ksa es fd;s x;s dk;kssZa dh ,ot esa jktLFkku flfoy lsok fu;e 92ch ds vuqlkj izfr rhu fnol ij ,d mikftZr vodk'k ykHk fn;s tkus ij fuEukuqlkj buds mikftZr [kkrsa esa tksMs tkus dh Lohd`fr iznku dh tkrh gSA \"","v":"     bl dk;kZy; ds deZpkjh Jh izeksn dqekj lSuh] v/;kid] jktdh; mPp ek/;fed fon~;ky; ekywrkuk ¼Fkkukxkth½ vyoj ds }kjk fofHkUUk vodk'k vof/k;ksa es fd;s x;s dk;kssZa dh ,ot esa jktLFkku flfoy lsok fu;e 92ch ds vuqlkj izfr rhu fnol ij ,d mikftZr vodk'k ykHk fn;s tkus ij fuEukuqlkj buds mikftZr [kkrsa esa tksMs tkus dh Lohd`fr iznku dh tkrh gSA "}]
["Ø- la-","vkns'k tkjhdrkZ vf/kdkjh@dk;kZy;","vkns'k dzekad","vkns'k fnukad","dk;Z fooj.k","dk;Z vof/k",null,null,"ns; mikftZr vodk'k"]
[{"$nulls":5},"ls","rd","dqy fnol"]
[{"$f":"IF(OR(OR(OR(B8=\"\",C8=\"\",E8=\"\",F8=\"\"))),\"\",1)","v":1},{"$f":"IF(Sheet14!B15=\"\",\"\",Sheet14!B15)","v":",lMh,e"},{"$f":"IF(Sheet14!C15=\"\",\"\",Sheet14!C15)","v":2012},{"$f":"IF(Sheet14!D15=\"\",\"\",TEXT(Sheet14!D15,\"DD-MM-YYYY\"))","v":"05-04-2023"},{"$f":"IF(Sheet14!E15=\"\",\"\",Sheet14!E15)","v":"vjh"},{"$f":"IF(Sheet14!F15=\"\",\"\",TEXT(Sheet14!F15,\"DD-MM-YYYY\"))","v":"01-12-2023"},{"$f":"IF(Sheet14!G15=\"\",\"\",TEXT(Sheet14!G15,\"DD-MM-YYYY\"))","v":"13-12-2023"},{"$f":"_xlfn.DAYS(G8,F8)+1","v":13},{"$f":"ROUNDDOWN(H8/3,0)","v":4}]
[{"$f":"IF(OR(OR(OR(B9=\"\",C9=\"\",E9=\"\",F9=\"\"))),\"\",MAX($A$8:A8)+1)","v":2},{"$f":"IF(Sheet14!B16=\"\",\"\",Sheet14!B16)","v":",lMh,e"},{"$f":"IF(Sheet14!C16=\"\",\"\",Sheet14!C16)","v":2013},{"$f":"IF(Sheet14!D16=\"\",\"\",TEXT(Sheet14!D16,\"DD-MM-YYYY\"))","v":"06-04-2023"},{"$f":"IF(Sheet14!E16=\"\",\"\",Sheet14!E16)","v":"vjh"},{"$f":"IF(Sheet14!F16=\"\",\"\",TEXT(Sheet14!F16,\"DD-MM-YYYY\"))","v":"02-12-2023"},{"$f":"IF(Sheet14!G16=\"\",\"\",TEXT(Sheet14!G16,\"DD-MM-YYYY\"))","v":"14-12-2023"},{"$f":"_xlfn.DAYS(G9,F9)+1","v":13},{"$f":"ROUNDDOWN(H9/3,0)","v":4}]
[{"$f":"IF(OR(OR(OR(B10=\"\",C10=\"\",E10=\"\",F10=\"\"))),\"\",MAX($A$8:A9)+1)","v":3},{"$f":"IF(Sheet14!B17=\"\",\"\",Sheet14!B17)","v":",lMh,e"},{"$f":"IF(Sheet14!C17=\"\",\"\",Sheet14!C17)","v":2014},{"$f":"IF(Sheet14!D17=\"\",\"\",TEXT(Sheet14!D17,\"DD-MM-YYYY\"))","v":"07-04-2023"},{"$f":"IF(Sheet14!E17=\"\",\"\",Sheet14!E17)","v":"vjh"},{"$f":"IF(Sheet14!F17=\"\",\"\",TEXT(Sheet14!F17,\"DD-MM-YYYY\"))","v":"03-12-2023"},{"$f":"IF(Sheet14!G17=\"\",\"\",TEXT(Sheet14!G17,\"DD-MM-YYYY\"))","v":"15-12-2023"},13,4]
[{"$f":"IF(OR(OR(OR(B11=\"\",C11=\"\",E11=\"\",F11=\"\"))),\"\",MAX($A$8:A10)+1)","v":4},{"$f":"IF(Sheet14!B18=\"\",\"\",Sheet14!B18)","v":",lMh,e"},{"$f":"IF(Sheet14!C18=\"\",\"\",Sheet14!C18)","v":2015},{"$f":"IF(Sheet14!D18=\"\",\"\",TEXT(Sheet14!D18,\"DD-MM-YYYY\"))","v":"08-04-2023"},{"$f":"IF(Sheet14!E18=\"\",\"\",Sheet14!E18)","v":"vjh"},{"$f":"IF(Sheet14!F18=\"\",\"\",TEXT(Sheet14!F18,\"DD-MM-YYYY\"))","v":"04-12-2023"},{"$f":"IF(Sheet14!G18=\"\",\"\",TEXT(Sheet14!G18,\"DD-MM-YYYY\"))","v":"16-12-2023"},13,4]
[{"$f":"IF(OR(OR(OR(B12=\"\",C12=\"\",E12=\"\",F12=\"\"))),\"\",MAX($A$8:A11)+1)","v":5},{"$f":"IF(Sheet14!B19=\"\",\"\",Sheet14!B19)","v":",lMh,e"},{"$f":"IF(Sheet14!C19=\"\",\"\",Sheet14!C19)","v":2016},{"$f":"IF(Sheet14!D19=\"\",\"\",TEXT(Sheet14!D19,\"DD-MM-YYYY\"))","v":"09-04-2023"},{"$f":"IF(Sheet14!E19=\"\",\"\",Sheet14!E19)","v":"vjh"},{"$f":"IF(Sheet14!F19=\"\",\"\",TEXT(Sheet14!F19,\"DD-MM-YYYY\"))","v":"05-12-2023"},{"$f":"IF(Sheet14!G19=\"\",\"\",TEXT(Sheet14!G19,\"DD-MM-YYYY\"))","v":"17-12-2023"},13,4]
[{"$f":"IF(OR(OR(OR(B13=\"\",C13=\"\",E13=\"\",F13=\"\"))),\"\",MAX($A$8:A12)+1)","v":6},{"$f":"IF(Sheet14!B20=\"\",\"\",Sheet14!B20)","v":",lMh,e"},{"$f":"IF(Sheet14!C20=\"\",\"\",Sheet14!C20)","v":2017},{"$f":"IF(Sheet14!D20=\"\",\"\",TEXT(Sheet14!D20,\"DD-MM-YYYY\"))","v":"10-04-2023"},{"$f":"IF(Sheet14!E20=\"\",\"\",Sheet14!E20)","v":"vjh"},{"$f":"IF(Sheet14!F20=\"\",\"\",TEXT(Sheet14!F20,\"DD-MM-YYYY\"))","v":"06-12-2023"},{"$f":"IF(Sheet14!G20=\"\",\"\",TEXT(Sheet14!G20,\"DD-MM-YYYY\"))","v":"18-12-2023"},13,4]
[{"$f":"IF(OR(OR(OR(B14=\"\",C14=\"\",E14=\"\",F14=\"\"))),\"\",MAX($A$8:A13)+1)","v":7},{"$f":"IF(Sheet14!B21=\"\",\"\",Sheet14!B21)","v":",lMh,e"},{"$f":"IF(Sheet14!C21=\"\",\"\",Sheet14!C21)","v":2018},{"$f":"IF(Sheet14!D21=\"\",\"\",TEXT(Sheet14!D21,\"DD-MM-YYYY\"))","v":"11-04-2023"},{"$f":"IF(Sheet14!E21=\"\",\"\",Sheet14!E21)","v":"vjh"},{"$f":"IF(Sheet14!F21=\"\",\"\",TEXT(Sheet14!F21,\"DD-MM-YYYY\"))","v":"07-12-2023"},{"$f":"IF(Sheet14!G21=\"\",\"\",TEXT(Sheet14!G21,\"DD-MM-YYYY\"))","v":"19-12-2023"},13,4]
[{"$f":"IF(OR(OR(OR(B15=\"\",C15=\"\",E15=\"\",F15=\"\"))),\"\",MAX($A$8:A14)+1)","v":8},{"$f":"IF(Sheet14!B22=\"\",\"\",Sheet14!B22)","v":",lMh,e"},{"$f":"IF(Sheet14!C22=\"\",\"\",Sheet14!C22)","v":2019},{"$f":"IF(Sheet14!D22=\"\",\"\",TEXT(Sheet14!D22,\"DD-MM-YYYY\"))","v":"12-04-2023"},{"$f":"IF(Sheet14!E22=\"\",\"\",Sheet14!E22)","v":"vjh"},{"$f":"IF(Sheet14!F22=\"\",\"\",TEXT(Sheet14!F22,\"DD-MM-YYYY\"))","v":"08-12-2023"},{"$f":"IF(Sheet14!G22=\"\",\"\",TEXT(Sheet14!G22,\"DD-MM-YYYY\"))","v":"20-12-2023"},13,4]
[{"$f":"IF(OR(OR(OR(B16=\"\",C16=\"\",E16=\"\",F16=\"\"))),\"\",MAX($A$8:A15)+1)","v":9},{"$f":"IF(Sheet14!B23=\"\",\"\",Sheet14!B23)","v":",lMh,e"},{"$f":"IF(Sheet14!C23=\"\",\"\",Sheet14!C23)","v":2020},{"$f":"IF(Sheet14!D23=\"\",\"\",TEXT(Sheet14!D23,\"DD-MM-YYYY\"))","v":"13-04-2023"},{"$f":"IF(Sheet14!E23=\"\",\"\",Sheet14!E23)","v":"vjh"},{"$f":"IF(Sheet14!F23=\"\",\"\",TEXT(Sheet14!F23,\"DD-MM-YYYY\"))","v":"09-12-2023"},{"$f":"IF(Sheet14!G23=\"\",\"\",TEXT(Sheet14!G23,\"DD-MM-YYYY\"))","v":"21-12-2023"},13,4]
[{"$f":"IF(OR(OR(OR(B17=\"\",C17=\"\",E17=\"\",F17=\"\"))),\"\",MAX($A$8:A16)+1)","v":10},{"$f":"IF(Sheet14!B24=\"\",\"\",Sheet14!B24)","v":",lMh,e"},{"$f":"IF(Sheet14!C24=\"\",\"\",Sheet14!C24)","v":2021},{"$f":"IF(Sheet14!D24=\"\",\"\",TEXT(Sheet14!D24,\"DD-MM-YYYY\"))","v":"14-04-2023"},{"$f":"IF(Sheet14!E24=\"\",\"\",Sheet14!E24)","v":"vjh"},{"$f":"IF(Sheet14!F24=\"\",\"\",TEXT(Sheet14!F24,\"DD-MM-YYYY\"))","v":"10-12-2023"},{"$f":"IF(Sheet14!G24=\"\",\"\",TEXT(Sheet14!G24,\"DD-MM-YYYY\"))","v":"22-12-2023"},13,4]
[]
[{"$nulls":5},"gLrk{kj MhMhvks e; in eqgj"]
["izfrfyfi fuEu dks lwpukFkZ ,oa vko’;d dk;Zokgh gsrq iszf\"kr gSA"]
["1- Jheku~ midks\"kkf/kdkjh] midks\"k dk;kZy;-------------------A"]
["2- ys[kk 'kk[kk] LFkkuh; dk;kZy;A"]
[{"$f":"\"3- lacaf/kr deZpkjh Jh@Jherh \"&Sheet14!$A$8&\"] \"&Sheet14!$A$10","v":"3- lacaf/kr deZpkjh Jh@Jherh izeksn dqekj lSuh] v/;kid"}]
[]
[{"$nulls":5},"gLrk{kj MhMhvks e; in eqgj"]