{"text_format":"3","workbook":"xlsx","n_sheets":6,"sheets":["Master Data","Deductions1","Deductions2","Deductions3","GA 55A","Tax Calculator By Ashwini"],"not_rendered":{"images":1,"macros":1,"defined_names":13},"read":"whole","date_system":"1900"}

{"sheet":"Master Data","index":0,"n_rows":105,"n_cols":43,"rows_kept":105,"merged":[[0,0,0,16],[1,0,1,16]]}
["All Staff IT Calculator 2024-25 By Ashwini Kumar Excel"]
["Office Name - www.ashwinisharma.com"]
[]
["Sr.No.","Employee Name","Post","PAN No.","Basic March 24","HRA %","Bonus Month","DA Arrear","Surrender Month","CCA Amount","Washing All. Amount","Handi.All. Ammout","Oth. All. 1","Oth.All. 2","Oth.Income","Bank interest Amount","FD & other interest"]
[null,2,3,4,5,6,7,8,9,10,11,12,13,14,15,16,17]
[{"$f":"IF(B6=\"\",\"\",ROW()-5)","v":1},"Ashwini Kumar 1","Lecturer","AAAAA5921A",{"v":51400,"d":"₹51,400.00"},{"v":0.1,"d":"10%"},12,"Yes","2024-03-01",{"$nulls":32},1,"2024-03-01"]
[{"$f":"IF(B7=\"\",\"\",ROW()-5)","v":2},"Arun Kumar","Teacher","AAAAA5922A",{"v":49900,"d":"₹49,900.00"},{"v":0.2,"d":"20%"},10,"No","2024-03-01",{"$nulls":32},2,"2024-04-01"]
[3,"Dhirendra Kumar","Lecturer","AAAAA5923A",{"v":52900,"d":"₹52,900.00"},{"v":0.1,"d":"10%"},12,"Yes","2024-12-01",{"$nulls":32},3,"2024-05-01"]
[4,"Ashwini Kumar 4",{"$nulls":39},4,"2024-06-01"]
[5,"Ashwini Kumar 5",{"$nulls":39},5,"2024-07-01"]
[6,"Ashwini Kumar 6",{"$nulls":39},6,"2024-08-01"]
[7,"Ashwini Kumar 7",{"$nulls":39},7,"2024-09-01"]
[8,"Ashwini Kumar 8",{"$nulls":39},8,"2024-10-01"]
[9,"Ashwini Kumar 9",{"$nulls":39},9,"2024-11-01"]
[10,"Ashwini Kumar 10",{"$nulls":39},10,"2024-12-01"]
{"$rows_left_out":91}
{"sheet":"Deductions1","index":1,"n_rows":104,"n_cols":38,"rows_kept":104,"merged":[[0,0,0,20],[1,0,1,20],[2,0,3,0],[2,1,3,1],[2,2,3,2],[2,3,3,3],[2,4,3,4],[2,5,3,5],[2,6,3,6],[2,7,3,7],[2,8,3,8],[2,9,2,20]]}
["All Staff IT Calculator 2024-25 By Ashwini Kumar Excel"]
[{"$f":"'Master Data'!A2","v":"Office Name - www.ashwinisharma.com"}]
["Sr.No.","Employee Name","SI","GPF/\nGPF2004 (other than Slab)","GIS","Hitkari Nidhi","LIC from Salary","Other Ded1","Other Ded2","Tax Deduction"]
[{"$nulls":9},"2024-03-01","2024-04-01","2024-05-01","2024-06-01","2024-07-01","2024-08-01","2024-09-01","2024-10-01","2024-11-01","2024-12-01","2025-01-01","2025-02-01"]
[{"$f":"IF('Master Data'!A6=\"\",\"\",'Master Data'!A6)","v":1},{"$f":"IF('Master Data'!B6=\"\",\"\",'Master Data'!B6)","v":"Ashwini Kumar 1"},3000,null,700,250,{"$nulls":30},1,"2024-03-01"]
[{"$f":"IF('Master Data'!A7=\"\",\"\",'Master Data'!A7)","v":2},{"$f":"IF('Master Data'!B7=\"\",\"\",'Master Data'!B7)","v":"Arun Kumar"},5000,8000,1400,500,{"$nulls":30},2,"2024-04-01"]
[{"$f":"IF('Master Data'!A8=\"\",\"\",'Master Data'!A8)","v":3},{"$f":"IF('Master Data'!B8=\"\",\"\",'Master Data'!B8)","v":"Dhirendra Kumar"},7000,null,2100,{"$nulls":31},3,"2024-05-01"]
[{"$f":"IF('Master Data'!A9=\"\",\"\",'Master Data'!A9)","v":4},{"$f":"IF('Master Data'!B9=\"\",\"\",'Master Data'!B9)","v":"Ashwini Kumar 4"},{"$nulls":3},500,{"$nulls":30},4,"2024-06-01"]
[{"$f":"IF('Master Data'!A10=\"\",\"\",'Master Data'!A10)","v":5},{"$f":"IF('Master Data'!B10=\"\",\"\",'Master Data'!B10)","v":"Ashwini Kumar 5"},{"$nulls":34},5,"2024-07-01"]
[{"$f":"IF('Master Data'!A11=\"\",\"\",'Master Data'!A11)","v":6},{"$f":"IF('Master Data'!B11=\"\",\"\",'Master Data'!B11)","v":"Ashwini Kumar 6"},{"$nulls":34},6,"2024-08-01"]
[{"$f":"IF('Master Data'!A12=\"\",\"\",'Master Data'!A12)","v":7},{"$f":"IF('Master Data'!B12=\"\",\"\",'Master Data'!B12)","v":"Ashwini Kumar 7"},{"$nulls":34},7,"2024-09-01"]
[{"$f":"IF('Master Data'!A13=\"\",\"\",'Master Data'!A13)","v":8},{"$f":"IF('Master Data'!B13=\"\",\"\",'Master Data'!B13)","v":"Ashwini Kumar 8"},{"$nulls":34},8,"2024-10-01"]
[{"$f":"IF('Master Data'!A14=\"\",\"\",'Master Data'!A14)","v":9},{"$f":"IF('Master Data'!B14=\"\",\"\",'Master Data'!B14)","v":"Ashwini Kumar 9"},{"$nulls":34},9,"2024-11-01"]
[{"$f":"IF('Master Data'!A15=\"\",\"\",'Master Data'!A15)","v":10},{"$f":"IF('Master Data'!B15=\"\",\"\",'Master Data'!B15)","v":"Ashwini Kumar 10"},{"$nulls":34},10,"2024-12-01"]
[{"$f":"IF('Master Data'!A16=\"\",\"\",'Master Data'!A16)","v":11},{"$f":"IF('Master Data'!B16=\"\",\"\",'Master Data'!B16)","v":"Ashwini Kumar 11"},{"$nulls":34},11,"2025-01-01"]
{"$rows_left_out":90}
{"sheet":"Deductions2","index":2,"n_rows":104,"n_cols":20,"rows_kept":104,"merged":[[0,0,0,19],[1,0,1,19]]}
["All Staff IT Calculator 2024-25 By Ashwini Kumar Excel"]
[{"$f":"'Master Data'!A2","v":"Office Name - www.ashwinisharma.com"}]
[]
["Sr.No.","Employee Name","HRA","Income from house property","Home Loan Interest","Home Loan Premium","LIC (other than Salary","PLI","Tution Fees","ULIP","NSC","NSC Interest","PPF","NSS","Sukanya Scheme","Equity Link Saving Scheme","Defferred Annuty","EPEF (80CCD1)","80CCC","Other Diposite In Section 80C"]
[{"$f":"IF('Master Data'!A6=\"\",\"\",'Master Data'!A6)","v":1},{"$f":"IF('Master Data'!B6=\"\",\"\",'Master Data'!B6)","v":"Ashwini Kumar 1"}]
[{"$f":"IF('Master Data'!A7=\"\",\"\",'Master Data'!A7)","v":2},{"$f":"IF('Master Data'!B7=\"\",\"\",'Master Data'!B7)","v":"Arun Kumar"}]
[{"$f":"IF('Master Data'!A8=\"\",\"\",'Master Data'!A8)","v":3},{"$f":"IF('Master Data'!B8=\"\",\"\",'Master Data'!B8)","v":"Dhirendra Kumar"}]
[{"$f":"IF('Master Data'!A9=\"\",\"\",'Master Data'!A9)","v":4},{"$f":"IF('Master Data'!B9=\"\",\"\",'Master Data'!B9)","v":"Ashwini Kumar 4"}]
[{"$f":"IF('Master Data'!A10=\"\",\"\",'Master Data'!A10)","v":5},{"$f":"IF('Master Data'!B10=\"\",\"\",'Master Data'!B10)","v":"Ashwini Kumar 5"}]
[{"$f":"IF('Master Data'!A11=\"\",\"\",'Master Data'!A11)","v":6},{"$f":"IF('Master Data'!B11=\"\",\"\",'Master Data'!B11)","v":"Ashwini Kumar 6"}]
[{"$f":"IF('Master Data'!A12=\"\",\"\",'Master Data'!A12)","v":7},{"$f":"IF('Master Data'!B12=\"\",\"\",'Master Data'!B12)","v":"Ashwini Kumar 7"}]
[{"$f":"IF('Master Data'!A13=\"\",\"\",'Master Data'!A13)","v":8},{"$f":"IF('Master Data'!B13=\"\",\"\",'Master Data'!B13)","v":"Ashwini Kumar 8"}]
[{"$f":"IF('Master Data'!A14=\"\",\"\",'Master Data'!A14)","v":9},{"$f":"IF('Master Data'!B14=\"\",\"\",'Master Data'!B14)","v":"Ashwini Kumar 9"}]
[{"$f":"IF('Master Data'!A15=\"\",\"\",'Master Data'!A15)","v":10},{"$f":"IF('Master Data'!B15=\"\",\"\",'Master Data'!B15)","v":"Ashwini Kumar 10"}]
[{"$f":"IF('Master Data'!A16=\"\",\"\",'Master Data'!A16)","v":11},{"$f":"IF('Master Data'!B16=\"\",\"\",'Master Data'!B16)","v":"Ashwini Kumar 11"}]
{"$rows_left_out":90}
{"sheet":"Deductions3","index":3,"n_rows":104,"n_cols":33,"rows_kept":104,"merged":[[0,0,0,13],[1,0,1,13]]}
["All Staff IT Calculator 2024-25 By Ashwini Kumar Excel"]
["Office Name - www.ashwinisharma.com"]
[]
["Sr.No.","Employee Name","80CCD(1)","80CCD(1B) (Max 50,000)","80 D (25000/\n50000 (Sr.Citi.)","80DD (75000/\n125000)","80DDB (40000/\n100000","80E","80G (50%/100%","80U (75000/ 125000","80GGA","80EE","80EEA","TDS/ Tax other than Salary"]
[{"$f":"IF('Master Data'!A6=\"\",\"\",'Master Data'!A6)","v":1},{"$f":"IF('Master Data'!B6=\"\",\"\",'Master Data'!B6)","v":"Ashwini Kumar 1"},{"$nulls":29},1,"2024-03-01"]
[{"$f":"IF('Master Data'!A7=\"\",\"\",'Master Data'!A7)","v":2},{"$f":"IF('Master Data'!B7=\"\",\"\",'Master Data'!B7)","v":"Arun Kumar"},{"$nulls":29},2,"2024-04-01"]
[{"$f":"IF('Master Data'!A8=\"\",\"\",'Master Data'!A8)","v":3},{"$f":"IF('Master Data'!B8=\"\",\"\",'Master Data'!B8)","v":"Dhirendra Kumar"},{"$nulls":29},3,"2024-05-01"]
[{"$f":"IF('Master Data'!A9=\"\",\"\",'Master Data'!A9)","v":4},{"$f":"IF('Master Data'!B9=\"\",\"\",'Master Data'!B9)","v":"Ashwini Kumar 4"},{"$nulls":29},4,"2024-06-01"]
[{"$f":"IF('Master Data'!A10=\"\",\"\",'Master Data'!A10)","v":5},{"$f":"IF('Master Data'!B10=\"\",\"\",'Master Data'!B10)","v":"Ashwini Kumar 5"},{"$nulls":29},5,"2024-07-01"]
[{"$f":"IF('Master Data'!A11=\"\",\"\",'Master Data'!A11)","v":6},{"$f":"IF('Master Data'!B11=\"\",\"\",'Master Data'!B11)","v":"Ashwini Kumar 6"},{"$nulls":29},6,"2024-08-01"]
[{"$f":"IF('Master Data'!A12=\"\",\"\",'Master Data'!A12)","v":7},{"$f":"IF('Master Data'!B12=\"\",\"\",'Master Data'!B12)","v":"Ashwini Kumar 7"},{"$nulls":29},7,"2024-09-01"]
[{"$f":"IF('Master Data'!A13=\"\",\"\",'Master Data'!A13)","v":8},{"$f":"IF('Master Data'!B13=\"\",\"\",'Master Data'!B13)","v":"Ashwini Kumar 8"},{"$nulls":29},8,"2024-10-01"]
[{"$f":"IF('Master Data'!A14=\"\",\"\",'Master Data'!A14)","v":9},{"$f":"IF('Master Data'!B14=\"\",\"\",'Master Data'!B14)","v":"Ashwini Kumar 9"},{"$nulls":29},9,"2024-11-01"]
[{"$f":"IF('Master Data'!A15=\"\",\"\",'Master Data'!A15)","v":10},{"$f":"IF('Master Data'!B15=\"\",\"\",'Master Data'!B15)","v":"Ashwini Kumar 10"},{"$nulls":29},10,"2024-12-01"]
[{"$f":"IF('Master Data'!A16=\"\",\"\",'Master Data'!A16)","v":11},{"$f":"IF('Master Data'!B16=\"\",\"\",'Master Data'!B16)","v":"Ashwini Kumar 11"},{"$nulls":29},11,"2025-01-01"]
{"$rows_left_out":90}
{"sheet":"GA 55A","index":4,"n_rows":30,"n_cols":37,"rows_kept":30,"merged":[[0,0,0,23],[1,2,1,22],[3,1,3,3],[3,4,3,8],[3,10,3,11],[3,12,3,15],[3,17,3,18],[3,19,3,22],[19,30,19,33],[28,0,28,2],[28,22,28,23],[29,6,29,17]]}
[{"$f":"'Master Data'!A2","v":"Office Name - www.ashwinisharma.com"}]
["Emp No.",1,"Salary and Deduction Detail for FY : 2024-25"]
[]
[null,"Name of Employee-",null,null,{"$f":"VLOOKUP($B$2,Master_Data,2,0)","v":"Ashwini Kumar 1"},{"$nulls":5},"Post",null,{"$f":"VLOOKUP($B$2,Master_Data,3,0)","v":"Lecturer"},{"$nulls":4},"PAN No.",null,{"$f":"VLOOKUP($B$2,Master_Data,4,0)","v":"AAAAA5921A"}]
[]
["Month & Year","Basic Pay","DA","HRA","Bonus","Wash Allowance","Handi. Allowance","CCA Allowance","Other Allowance","Gross Salary","SIP","SI Loan","SI Loan Interest","GPF/\nGPF2004","GPF Loan","RGHS","GIS","LIC","Hitkari Nidhi","Other Ded1","Other Ded2","ITAX","Total Deduction","NET Payment"]
["2024-03-01",{"$f":"VLOOKUP($B$2,Master_Data,5,0)","v":{"v":51400,"d":"51,400"}},{"$f":"IFERROR(ROUND(B7*50%,0),0)","v":{"v":25700,"d":"25,700"}},{"$f":"ROUND(IF(VLOOKUP($B$2,Master_Data,6,0)=10%,B7*9%,B7*18%),0)","v":{"v":4626,"d":"4,626"}},null,{"$f":"VLOOKUP($B$2,Master_Data,11,0)","v":0},{"$f":"VLOOKUP($B$2,Master_Data,12,0)","v":0},{"$f":"VLOOKUP($B$2,Master_Data,10,0)","v":0},{"$f":"VLOOKUP($B$2,Master_Data,13,0)","v":0},{"$f":"SUM(B7:I7)","v":{"v":81726,"d":"81,726"}},{"$f":"VLOOKUP($B$2,Ded_1,3,0)","v":{"v":3000,"d":"3,000"}},null,null,{"$f":"IF(VLOOKUP($B$2,Ded_1,4,0)>0,VLOOKUP($B$2,Ded_1,4,0),IF(B7<23101,1450,IF(B7<28501,1625,IF(B7<38501,2100,IF(B7<51501,2850,IF(B7<62001,3575,IF(B7<72001,4200,IF(B7<80001,4800,IF(B7<116001,6150,IF(B7<167001,8900,10500))))))))))","v":{"v":2850,"d":"2,850"}},null,{"$f":"IF(B7<18001,265,IF(B7<33501,440,IF(B7<54001,658,875)))","v":658},null,{"$f":"VLOOKUP($B$2,Ded_1,7,0)","v":0},null,{"$f":"VLOOKUP($B$2,Ded_1,8,0)","v":0},{"$f":"VLOOKUP($B$2,Ded_1,9,0)","v":0},{"$f":"VLOOKUP($B$2,Ded_1,10,0)","v":0},{"$f":"SUM(K7:V7)","v":{"v":6508,"d":"6,508"}},{"$f":"J7-W7","v":{"v":75218,"d":"75,218"}},{"$nulls":6},"2024-03-01",{"$f":"B7","v":{"v":51400,"d":"51,400"}},{"v":0.5,"d":"50%"},{"$f":"C7","v":{"v":25700,"d":"25,700"}}]
["2024-04-01",{"$f":"B7","v":{"v":51400,"d":"51,400"}},{"$f":"IFERROR(ROUND(B7*50%,0),0)","v":{"v":25700,"d":"25,700"}},{"$f":"ROUND(IF(VLOOKUP($B$2,Master_Data,6,0)=10%,B8*9%,B8*18%),0)","v":{"v":4626,"d":"4,626"}},null,{"$f":"F7","v":0},{"$f":"G7","v":0},{"$f":"H7","v":0},{"$f":"I7","v":0},{"v":81726,"d":"81,726"},{"$f":"K7","v":{"v":3000,"d":"3,000"}},{"$f":"L7","v":0},{"$f":"M7","v":0},{"$f":"IF(VLOOKUP($B$2,Ded_1,4,0)>0,VLOOKUP($B$2,Ded_1,4,0),IF(B8<23101,1450,IF(B8<28501,1625,IF(B8<38501,2100,IF(B8<51501,2850,IF(B8<62001,3575,IF(B8<72001,4200,IF(B8<80001,4800,IF(B8<116001,6150,IF(B8<167001,8900,10500))))))))))","v":{"v":2850,"d":"2,850"}},{"$f":"O7","v":0},{"$f":"IF(B8<18001,265,IF(B8<33501,440,IF(B8<54001,658,875)))","v":658},{"$f":"VLOOKUP($B$2,Ded_1,5,0)","v":700},{"$f":"R7","v":0},null,{"$f":"T7","v":0},{"$f":"U7","v":0},{"$f":"VLOOKUP($B$2,Ded_1,11,0)","v":0},{"v":7208,"d":"7,208"},{"v":74518,"d":"74,518"},{"$nulls":6},"2024-04-01",{"$f":"B7","v":{"v":51400,"d":"51,400"}},{"v":0.5,"d":"50%"},{"v":25700,"d":"25,700"}]
["2024-05-01",{"$f":"B7","v":{"v":51400,"d":"51,400"}},{"$f":"IFERROR(ROUND(B9*50%,0),0)","v":{"v":25700,"d":"25,700"}},{"$f":"ROUND(IF(VLOOKUP($B$2,Master_Data,6,0)=10%,B9*9%,B9*18%),0)","v":{"v":4626,"d":"4,626"}},null,{"$f":"F8","v":0},{"$f":"G8","v":0},{"$f":"H8","v":0},{"$f":"I8","v":0},{"v":81726,"d":"81,726"},{"$f":"K8","v":{"v":3000,"d":"3,000"}},{"$f":"L8","v":0},{"$f":"M8","v":0},{"$f":"IF(VLOOKUP($B$2,Ded_1,4,0)>0,VLOOKUP($B$2,Ded_1,4,0),IF(B9<23101,1450,IF(B9<28501,1625,IF(B9<38501,2100,IF(B9<51501,2850,IF(B9<62001,3575,IF(B9<72001,4200,IF(B9<80001,4800,IF(B9<116001,6150,IF(B9<167001,8900,10500))))))))))","v":{"v":2850,"d":"2,850"}},{"$f":"O8","v":0},{"$f":"IF(B9<18001,265,IF(B9<33501,440,IF(B9<54001,658,875)))","v":658},null,{"$f":"R8","v":0},null,{"$f":"T8","v":0},{"$f":"U8","v":0},{"$f":"VLOOKUP($B$2,Ded_1,12,0)","v":0},{"v":6508,"d":"6,508"},{"v":75218,"d":"75,218"},{"$nulls":6},"2024-05-01",{"$f":"B9","v":{"v":51400,"d":"51,400"}},{"v":0.5,"d":"50%"},{"v":25700,"d":"25,700"}]
["2024-06-01",{"$f":"B9","v":{"v":51400,"d":"51,400"}},{"$f":"IFERROR(ROUND(B10*50%,0),0)","v":{"v":25700,"d":"25,700"}},{"$f":"ROUND(IF(VLOOKUP($B$2,Master_Data,6,0)=10%,B10*9%,B10*18%),0)","v":{"v":4626,"d":"4,626"}},null,{"$f":"F9","v":0},{"$f":"G9","v":0},{"$f":"H9","v":0},{"$f":"I9","v":0},{"v":81726,"d":"81,726"},{"$f":"K9","v":{"v":3000,"d":"3,000"}},{"$f":"L9","v":0},{"$f":"M9","v":0},{"$f":"IF(VLOOKUP($B$2,Ded_1,4,0)>0,VLOOKUP($B$2,Ded_1,4,0),IF(B10<23101,1450,IF(B10<28501,1625,IF(B10<38501,2100,IF(B10<51501,2850,IF(B10<62001,3575,IF(B10<72001,4200,IF(B10<80001,4800,IF(B10<116001,6150,IF(B10<167001,8900,10500))))))))))","v":{"v":2850,"d":"2,850"}},{"$f":"O9","v":0},{"$f":"IF(B10<18001,265,IF(B10<33501,440,IF(B10<54001,658,875)))","v":658},null,{"$f":"R9","v":0},null,{"$f":"T9","v":0},{"$f":"U9","v":0},{"$f":"VLOOKUP($B$2,Ded_1,13,0)","v":0},{"v":6508,"d":"6,508"},{"v":75218,"d":"75,218"},{"$nulls":6},"2024-06-01",{"v":51400,"d":"51,400"},{"v":0.5,"d":"50%"},{"v":25700,"d":"25,700"}]
["2024-07-01",{"$f":"IFERROR(MROUND(B10*1.03,100),0)","v":{"v":52900,"d":"52,900"}},{"$f":"IFERROR(ROUND(B11*50%,0),0)","v":{"v":26450,"d":"26,450"}},{"$f":"ROUND(IF(VLOOKUP($B$2,Master_Data,6,0)=10%,B11*9%,B11*18%),0)","v":{"v":4761,"d":"4,761"}},null,{"$f":"F10","v":0},{"$f":"G10","v":0},{"$f":"H10","v":0},{"$f":"I10","v":0},{"v":84111,"d":"84,111"},{"$f":"K10","v":{"v":3000,"d":"3,000"}},{"$f":"L10","v":0},{"$f":"M10","v":0},{"$f":"IF(VLOOKUP($B$2,Ded_1,4,0)>0,VLOOKUP($B$2,Ded_1,4,0),IF(B11<23101,1450,IF(B11<28501,1625,IF(B11<38501,2100,IF(B11<51501,2850,IF(B11<62001,3575,IF(B11<72001,4200,IF(B11<80001,4800,IF(B11<116001,6150,IF(B11<167001,8900,10500))))))))))","v":{"v":3575,"d":"3,575"}},{"$f":"O10","v":0},{"$f":"IF(B11<18001,265,IF(B11<33501,440,IF(B11<54001,658,875)))","v":658},null,{"$f":"R10","v":0},null,{"$f":"T10","v":0},{"$f":"U10","v":0},{"$f":"VLOOKUP($B$2,Ded_1,14,0)","v":0},{"v":7233,"d":"7,233"},{"v":76878,"d":"76,878"},{"$nulls":6},"2024-07-01",{"v":52900,"d":"52,900"},{"v":0.5,"d":"50%"},{"v":26450,"d":"26,450"},{"$f":"ROUND(AF11/2*3%,0)","v":794},null,{"$f":"VLOOKUP($B$2,Master_Data,5,0)","v":51400}]
["2024-08-01",{"$f":"B11","v":{"v":52900,"d":"52,900"}},{"$f":"IFERROR(ROUND(B12*50%,0),0)","v":{"v":26450,"d":"26,450"}},{"$f":"ROUND(IF(VLOOKUP($B$2,Master_Data,6,0)=10%,B12*9%,B12*18%),0)","v":{"v":4761,"d":"4,761"}},null,{"$f":"F11","v":0},{"$f":"G11","v":0},{"$f":"H11","v":0},{"$f":"I11","v":0},{"v":84111,"d":"84,111"},{"$f":"K11","v":{"v":3000,"d":"3,000"}},{"$f":"L11","v":0},{"$f":"M11","v":0},{"$f":"IF(VLOOKUP($B$2,Ded_1,4,0)>0,VLOOKUP($B$2,Ded_1,4,0),IF(B12<23101,1450,IF(B12<28501,1625,IF(B12<38501,2100,IF(B12<51501,2850,IF(B12<62001,3575,IF(B12<72001,4200,IF(B12<80001,4800,IF(B12<116001,6150,IF(B12<167001,8900,10500))))))))))","v":{"v":3575,"d":"3,575"}},{"$f":"O11","v":0},{"$f":"IF(B12<18001,265,IF(B12<33501,440,IF(B12<54001,658,875)))","v":658},null,{"$f":"R11","v":0},null,{"$f":"T11","v":0},{"$f":"U11","v":0},{"$f":"VLOOKUP($B$2,Ded_1,15,0)","v":0},{"v":7233,"d":"7,233"},{"v":76878,"d":"76,878"},{"$nulls":6},"2024-08-01",{"v":52900,"d":"52,900"},{"v":0.5,"d":"50%"},{"v":26450,"d":"26,450"},{"$f":"ROUND(AF12/2*3%,0)","v":794}]
["2024-09-01",{"$f":"B12","v":{"v":52900,"d":"52,900"}},{"$f":"IFERROR(ROUND(B13*50%,0),0)","v":{"v":26450,"d":"26,450"}},{"$f":"ROUND(IF(VLOOKUP($B$2,Master_Data,6,0)=10%,B13*9%,B13*18%),0)","v":{"v":4761,"d":"4,761"}},null,{"$f":"F12","v":0},{"$f":"G12","v":0},{"$f":"H12","v":0},{"$f":"I12","v":0},{"v":84111,"d":"84,111"},{"$f":"K12","v":{"v":3000,"d":"3,000"}},{"$f":"L12","v":0},{"$f":"M12","v":0},{"$f":"IF(VLOOKUP($B$2,Ded_1,4,0)>0,VLOOKUP($B$2,Ded_1,4,0),IF(B13<23101,1450,IF(B13<28501,1625,IF(B13<38501,2100,IF(B13<51501,2850,IF(B13<62001,3575,IF(B13<72001,4200,IF(B13<80001,4800,IF(B13<116001,6150,IF(B13<167001,8900,10500))))))))))","v":{"v":3575,"d":"3,575"}},{"$f":"O12","v":0},{"$f":"IF(B13<18001,265,IF(B13<33501,440,IF(B13<54001,658,875)))","v":658},null,{"$f":"R12","v":0},null,{"$f":"T12","v":0},{"$f":"U12","v":0},{"$f":"VLOOKUP($B$2,Ded_1,16,0)","v":0},{"v":7233,"d":"7,233"},{"v":76878,"d":"76,878"},{"$nulls":6},"2024-09-01",{"v":52900,"d":"52,900"},{"v":0.5,"d":"50%"},{"v":26450,"d":"26,450"},794]
["2024-10-01",{"$f":"B13","v":{"v":52900,"d":"52,900"}},{"$f":"IFERROR(ROUND(B14*50%,0),0)","v":{"v":26450,"d":"26,450"}},{"$f":"ROUND(IF(VLOOKUP($B$2,Master_Data,6,0)=10%,B14*9%,B14*18%),0)","v":{"v":4761,"d":"4,761"}},null,{"$f":"F13","v":0},{"$f":"G13","v":0},{"$f":"H13","v":0},{"$f":"I13","v":0},{"v":84111,"d":"84,111"},{"$f":"K13","v":{"v":3000,"d":"3,000"}},{"$f":"L13","v":0},{"$f":"M13","v":0},{"$f":"IF(VLOOKUP($B$2,Ded_1,4,0)>0,VLOOKUP($B$2,Ded_1,4,0),IF(B14<23101,1450,IF(B14<28501,1625,IF(B14<38501,2100,IF(B14<51501,2850,IF(B14<62001,3575,IF(B14<72001,4200,IF(B14<80001,4800,IF(B14<116001,6150,IF(B14<167001,8900,10500))))))))))","v":{"v":3575,"d":"3,575"}},{"$f":"O13","v":0},{"$f":"IF(B14<18001,265,IF(B14<33501,440,IF(B14<54001,658,875)))","v":658},null,{"$f":"R13","v":0},null,{"$f":"T13","v":0},{"$f":"U13","v":0},{"$f":"VLOOKUP($B$2,Ded_1,17,0)","v":0},{"v":7233,"d":"7,233"},{"v":76878,"d":"76,878"},{"$nulls":6},"2024-10-01",{"v":52900,"d":"52,900"},{"v":0.5,"d":"50%"},{"v":26450,"d":"26,450"},794]
["2024-11-01",{"$f":"B14","v":{"v":52900,"d":"52,900"}},{"$f":"IFERROR(ROUND(B15*53%,0),0)","v":{"v":28037,"d":"28,037"}},{"$f":"ROUND(VLOOKUP($B$2,Master_Data,6,0)*B15,0)","v":{"v":5290,"d":"5,290"}},null,{"$f":"F14","v":0},{"$f":"G14","v":0},{"$f":"H14","v":0},{"$f":"I14","v":0},{"v":86227,"d":"86,227"},{"$f":"K14","v":{"v":3000,"d":"3,000"}},{"$f":"L14","v":0},{"$f":"M14","v":0},{"$f":"IF(VLOOKUP($B$2,Ded_1,4,0)>0,VLOOKUP($B$2,Ded_1,4,0),IF(B15<23101,1450,IF(B15<28501,1625,IF(B15<38501,2100,IF(B15<51501,2850,IF(B15<62001,3575,IF(B15<72001,4200,IF(B15<80001,4800,IF(B15<116001,6150,IF(B15<167001,8900,10500))))))))))","v":{"v":3575,"d":"3,575"}},{"$f":"O14","v":0},{"$f":"IF(B15<18001,265,IF(B15<33501,440,IF(B15<54001,658,875)))","v":658},null,{"$f":"R14","v":0},null,{"$f":"T14","v":0},{"$f":"U14","v":0},{"$f":"VLOOKUP($B$2,Ded_1,18,0)","v":0},{"v":7233,"d":"7,233"},{"v":78994,"d":"78,994"},{"$nulls":6},"2024-11-01",{"v":52900,"d":"52,900"},{"v":0.53,"d":"53%"},{"v":28037,"d":"28,037"}]
{"$rows_left_out":16}
{"sheet":"Tax Calculator By Ashwini","index":5,"n_rows":70,"n_cols":24,"rows_kept":70,"merged":[[0,0,0,14],[1,0,1,2],[1,6,1,11],[2,1,2,2],[2,3,2,6],[2,7,2,8],[2,9,2,11],[2,12,2,13],[3,1,3,13],[4,1,4,13],[5,1,5,13],[6,0,9,0],[6,1,6,12],[6,14,8,14],[7,1,7,12],[8,1,8,12],[9,1,9,13],[10,1,10,13],[11,0,14,0],[11,1,11,7],[11,8,11,11],[11,12,11,13],[11,14,13,14],[12,1,13,3],[12,4,12,5],[12,6,12,7],[12,8,12,9],[12,10,12,13],[13,4,13,5],[13,6,13,7],[13,8,13,9],[13,10,13,13],[14,1,14,13],[15,1,15,13],[16,1,16,13],[17,1,17,13],[18,1,18,14],[19,2,19,5],[19,6,19,7],[19,9,19,12],[19,14,28,14],[20,2,20,5],[20,6,20,7],[20,9,20,12],[21,2,21,5],[21,6,21,7],[21,9,21,12],[22,2,22,5],[22,6,22,7],[22,9,22,12],[23,2,23,5],[23,6,23,7],[23,9,23,12],[24,2,24,5],[24,6,24,7],[24,9,24,12],[25,2,25,5],[25,6,25,7],[25,9,25,12],[26,2,26,5],[26,6,26,7],[26,9,26,12],[27,2,27,5],[27,6,27,7],[27,8,28,8],[27,9,28,12],[27,13,28,13],[28,2,28,5],[28,6,28,7],[29,1,29,13],[30,2,30,13],[31,2,31,13],[32,1,32,13],[33,1,33,14],[34,2,34,13],[35,2,35,13],[36,2,36,13],[37,2,37,13],[38,2,38,13],[39,2,39,13],[40,2,40,13],[41,2,41,13],[42,2,42,13],[43,2,43,13],[44,2,44,13],[45,1,45,13],[46,1,46,13],[47,1,47,13],[48,1,48,13],[49,0,61,0],[49,1,49,14],[50,1,50,10],[50,11,50,13],[51,1,51,4],[51,5,51,7],[51,8,51,10],[51,11,51,12],[51,17,51,18],[52,1,52,3],[52,5,52,6],[52,8,52,9],[52,11,52,12],[52,17,52,18],[53,1,53,3],[53,5,53,6],[53,8,53,9],[53,11,53,12],[53,17,53,18],[54,1,54,3],[54,5,54,6],[54,8,54,9],[54,11,54,12],[54,17,54,18],[55,1,56,3],[55,4,56,4],[55,5,56,6],[55,7,56,7],[55,8,56,9],[55,10,56,10],[55,11,55,12],[55,17,55,18],[56,11,56,12],[57,2,57,12],[58,2,58,12],[59,2,59,13],[60,2,60,13],[61,1,61,13],[62,1,62,13],[63,1,63,13],[64,0,66,0],[64,1,64,14],[67,0,67,13],[69,0,69,4],[69,5,69,12],[69,13,69,14]]}
[{"$f":"'Master Data'!A2","v":"Office Name - www.ashwinisharma.com"}]
["Employee No.",null,null,{"$f":"IF('GA 55A'!B2=\"\",\"\",'GA 55A'!B2)","v":1},null,null,"INCOME TAX CALCULATION FORM FY 2024-25",{"$nulls":5},{"$f":"IF(O2=\"New Regime\",1,2)","v":1},"Select Regime","New Regime"]
[1,"Name -",null,{"$f":"VLOOKUP(D2,Master_Data,2,0)","v":"Ashwini Kumar 1"},{"$nulls":3},"Post -",null,{"$f":"VLOOKUP(D2,Master_Data,3,0)","v":"Lecturer"},null,null,"PAN No.- ",null,{"$f":"VLOOKUP(D2,Master_Data,4,0)","v":"AAAAA5921A"}]
[2,"Total salary received in Financial Year 2024-25",{"$nulls":12},{"$f":"IF('GA 55A'!J27=\"\",\"\",'GA 55A'!J27)","v":{"v":1064040,"d":"₹1,064,040.00"}}]
[3,"House rent, under section 10 (13-A) and other allowances under section 10 (14) which are tax free -",{"$nulls":12},{"$f":"IF(M2=2,VLOOKUP(D2,Ded_2,3,0),0)","v":0}]
[4,"Balance (2-3)",{"$nulls":12},{"$f":"IF(M2=2,O4-O5,O4)","v":{"v":1064040,"d":"₹1,064,040.00"}}]
[5,{"$f":"IF(M2=1,\"Standard Deduction Maxium 75000 Section 16 (i a)\",\"(I)Standard Deduction Maxium 50000 Section 16 (i a)\")","v":"Standard Deduction Maxium 75000 Section 16 (i a)"},{"$nulls":11},{"$f":"IF(M2=1,75000,50000)","v":{"v":75000,"d":"75,000.00"}}]
[null,"(II) Entertainment Allowance under Section 16(ii) Maxium 5000",{"$nulls":11},{"v":0,"d":"0.00"}]
[null,"(III)Business tax under section 16 (iii)",{"$nulls":11},{"v":0,"d":"0.00"}]
[null,"Total 5",{"$nulls":12},{"$f":"SUM(N7:N9)","v":{"v":75000,"d":"₹75,000.00"}}]
[6,"Balance(4-5)",{"$nulls":12},{"$f":"O6-O10","v":{"v":989040,"d":"₹989,040.00"}}]
[7,"(A) Income from house property (1) Nil for own use",{"$nulls":6},"(2) Rent received Rs.",{"$nulls":3},{"$f":"IF(M2=2,VLOOKUP(D2,Ded_2,4,0),0)","v":{"v":0,"d":"0.00"}}]
[null,"(B) Subtract",null,null,"30% of rent",null,"Home Loan Interest",null,"House Tax",null,"Sum 7 (B)"]
[{"$nulls":4},{"$f":"ROUND($M$12*0.3,0)","v":{"v":0,"d":"0.00"}},null,{"$f":"IF(M2=2,VLOOKUP(D2,Ded_2,5,0),0)","v":{"v":0,"d":"0.00"}},null,{"v":0,"d":"0.00"},null,{"$f":"SUM(E14:J14)","v":{"v":0,"d":"0.00"}}]
[null,"Balance - / + (of 7(A) and 7(B)",{"$nulls":12},{"$f":"IF(M2=2,$M$12-$K$14,0)","v":0}]
{"$rows_left_out":55}