{"text_format":"3","workbook":"xlsx","n_sheets":7,"sheets":["info","GA55","7pay matrix chart","TAX CALCULATION","OLD TAX REGIME","NEW TAX REGIME","PAY SLIP"],"not_rendered":{"images":4,"macros":1,"defined_names":24,"comments":2},"read":"whole","date_system":"1900"}

{"sheet":"info","index":0,"n_rows":33,"n_cols":14,"rows_kept":33,"merged":[[1,1,1,15],[2,1,2,15],[3,1,3,15],[4,1,8,1],[4,2,4,15],[5,2,5,15],[6,2,6,15],[7,2,7,15],[8,2,8,15],[9,1,10,1],[9,2,9,15],[10,2,10,15],[11,1,12,1],[11,2,11,15],[12,2,12,15],[13,1,14,1],[13,2,13,15],[14,2,14,15],[15,1,16,1],[15,2,15,15],[16,2,16,15],[17,1,18,1],[17,2,17,15],[18,2,18,15],[19,2,19,15],[20,1,21,4],[20,5,21,8],[20,9,21,10],[20,11,21,15],[22,3,22,15],[23,3,23,15],[24,3,24,15],[25,6,25,7],[25,8,25,15],[26,3,26,15],[27,3,29,5],[27,6,29,8],[27,9,29,12],[27,13,29,15],[30,3,31,8],[30,9,31,12],[30,13,31,15],[32,1,33,6],[32,7,33,9],[32,10,33,15]]}
[]
[null,"INCOMETAX 2021-22 SOFTWARE में आपका स्वागत है "]
[null,"करणीय कार्य"]
[null,"यह प्रोग्राम विशेषकर राजस्थान के सभी शिक्षा' विभाग के कर्मचारीगण हेतु सरल,सहज,एंव स्मार्ट तरीके से बनाया गया है"]
[null,1,"GA 55 SHEET"]
[null,null,"दोस्तों सबसे पहले GA55 SHEET में YELLO SHELL में ENTRY करे "]
[null,null,"इसके बाद मार्च माह का वेतन ENTER करे और आपसे संबधित जानकारी का चुनाव करे और आपका GA 55 तैयार है"]
[null,null,"आयकर स्लैब का चयन करे "]
[null,null,"कटौती में GPF,SIP,GPF LOAN,INCOMETAX इत्यादि की entry करे बाकी cell ऑटो जनरेट है BILL NO एंव TV NO MANUAL FEED करे"]
[null,2,"7 PAY MATRIX CHART"]
[null,null,"इस sheet को लॉक किया गया है आप अपना लेवल के अनुसार basic पे देख सकते है !"]
[null,3,"TAX CALCULATION"]
[null,null,"यह sheet भी लॉक है आप OLD TAX REGIME और NEW TAX REGIME में आपके लिए कोनसी BETTER है का चुनाव कर सकते है"]
[null,4,"OLD TAX REGIME "]
[null,null,"इस sheet में आयकर विभाग द्वारा जिस धारा की छूट GA 55 के अलावा है तो DARK cell में entry करे"]
{"$rows_left_out":19}
{"sheet":"GA55","index":1,"n_rows":65,"n_cols":115,"rows_kept":65,"merged":[[0,0,4,0],[0,1,0,18],[0,19,0,21],[0,49,4,49],[0,50,5,50],[1,1,1,18],[1,19,1,21],[1,23,1,24],[2,1,2,7],[2,8,2,9],[2,10,2,18],[2,19,2,21],[2,23,3,24],[3,1,3,14],[3,16,3,18],[3,19,3,21],[4,1,4,10],[4,12,4,21],[4,23,5,24],[5,1,5,10],[5,12,5,21],[6,1,6,24],[7,1,7,17],[7,18,7,21],[7,22,7,24],[8,1,8,2],[8,3,8,7],[8,9,8,12],[8,14,8,17],[8,18,8,21],[8,22,8,24],[9,1,9,2],[9,3,9,4],[9,5,9,6],[9,7,9,10],[9,12,9,19],[9,20,9,21],[9,22,9,24],[10,1,10,2],[10,3,10,6],[10,7,10,8],[10,9,10,11],[10,12,10,14],[10,15,10,18],[10,19,10,21],[10,22,10,24],[16,35,16,40],[17,35,17,36],[18,35,18,36],[19,35,19,36],[20,35,20,36],[21,35,21,36],[35,2,35,6],[35,19,35,23],[36,2,36,6],[36,9,36,15],[36,19,36,23],[37,2,37,4]]}
[null,"आप आयकर गणना प्रपत्र पुराना लेना चाहते है तो DROPDOWN MENU में OLD अथवा नए के लिए new का चयन करे |",{"$nulls":20},"OLD","TAX",{"$f":"IF(W1=\"OLD\",'OLD TAX REGIME'!M55,'NEW TAX REGIME'!M56)","v":43921},{"$nulls":25},"SIP,SIL,GPF,LIC,  GIL,IT की कटोती MANUAL मार्च21 से करे"]
[null,"क्या आप 01.01.2004 के बाद नियुक्त है तो DROPDOWN मेनू में YES अथवा NO का चयन करे|",{"$nulls":20},"YES","HRA",{"$nulls":4},{"$f":"IF(W2=\"yes\",AB13,IF(W2=\"no\",AC16))","v":6119},{"$nulls":9},1,{"$f":"W9","v":52300},31,{"$f":"AN2/AO2*15","v":25306.451612903224},{"$f":"ROUND(AP2,0)","v":25306},{"$f":"ROUND(AQ2*17/100,0)","v":4302}]
[null,"कर्मचारी का राज्य सेवा में प्रकार",{"$nulls":6},"REGULAR",null,"क्या आपको बोनस मिला है तो YES अथवा NO का चयन करे",{"$nulls":11},"YES",{"$nulls":8},{"v":0.08,"d":"8%"},{"$nulls":6},2,{"$f":"D14","v":52300},29,{"$f":"AN3/AO3*15","v":27051.724137931036},{"$f":"ROUND(AP3,0)","v":27052},{"$f":"ROUND(AQ3*17/100,0)","v":4599}]
[null,"क्या आपको समर्पित अवकाश मिला है तो YES अथवा NO का चयन करे",{"$nulls":13},"NO","किस माह में उठाया",{"$nulls":5},10,{"$nulls":5},"YES",null,",uih,l",{"v":0.16,"d":"16%"},{"$nulls":6},3,{"$f":"D15","v":52300},31,25306.451612903224,25306,4302,{"$nulls":3},"OLD"]
[null,"क्या आपको विशेषयोग्यजन कर्मचारी भत्ता मिलता है|",{"$nulls":9},"NO","क्या आपको मार्च2020 का एरियर भुगतान इस वर्ष मिला है",{"$nulls":9},"YES",{"v":0.09,"d":"9%"},{"$nulls":6},"thih,Q",{"$nulls":7},4,{"$f":"D16","v":52300},30,26150,26150,4446,{"$nulls":3},"NEW"]
[null,"NPS के कर्मचारी RGHS में स्वेच्छिक कटोती करवाना चाहते है ",{"$nulls":9},"YES","क्या आपको HRA की छूट देय है  ",{"$nulls":9},"YES",{"$nulls":15},0,{"$nulls":4},0]
[null,"OFFICE GOVT.SR.SEC.SCHOOL ALNIYAWAS DISTT.-NAGAUR",{"$nulls":26},"REGULAR","YES",{"$nulls":8},5,{"$f":"D17","v":53900},31,26080.645161290322,26081,4434,{"$nulls":13},"OLD TAX REGIME"]
[null,"वेतन एंव कर निर्धारण वर्ष 2021-22",{"$nulls":16},"आयकर स्लैब का चयन",{"$nulls":3},"OLD TAX REGIME",{"$nulls":5},"PROBATION","NO","YES","surender",2,{"$nulls":5},6,53900,30,26950,26950,4582,{"$nulls":13},"NEW TAX REGIME"]
[null,"नाम कर्मचारी",null,"VIJAY KUMAR PRAJAPAT",{"$nulls":4},"पद","lecturer",{"$nulls":3},"पेन न","QYPP0000J",{"$nulls":3},"Basic Pay (IN MARCH)",{"$nulls":3},52300,{"$nulls":6},{"$f":"IF(AC4>=\"YES\",(D13+E13)*10/100)","v":6119.1},"NO",{"$nulls":7},7,53900,31,26080.645161290322,26081,{"$f":"ROUND(AQ9*31/100,0)","v":8085},{"$nulls":9},"(    OLD TAX REGIME    )"]
[null,"राज्य बीमा",null,0,null,"जीपीएफ/एनपीएस",null,111111111111,{"$nulls":3},"बैंक ब्रांच","STATE BANK OF INDIA RIYAN BARI",{"$nulls":7},"Bank A/c",null,61000000000,{"$nulls":3},{"$f":"ROUND(W9-(W9*0.03),2)","v":50731},{"$f":"ROUND(AA10,-2)","v":50700},{"$nulls":3},{"$f":"VLOOKUP(L5,B13:E24,3,0)","v":{"$error":"#N/A"}},{"$nulls":6},8,53900,31,26080.645161290322,26081,{"$f":"ROUND(AQ10*31/100,0)","v":8085},{"$nulls":9},"(    NEW TAX REGIME        )"]
[null,"आधार नम्बर",null,333333333333,{"$nulls":3},"टेन नम्बर",null,"JDHG00000H",null,null,"मोबाइल नम्बर",null,null,0,{"$nulls":3},"EMPLOYEE ID",null,null,"RJNA0000000000",{"$nulls":15},9,{"$f":"D20","v":53900},30,{"$f":"AN11/AO11*15","v":26950},{"$f":"ROUND(AP11,0)","v":26950},8355,{"$nulls":12},{"$f":"IF(W2=\"YES\",\" \",\" \")","v":" "}]
[null,"S. NO.","Months & Year","Basic pay","Dearness allowance","H.R.A.","Handicaped allowance","Washing allowance","other","other1","Gross pay","NPS","GPF","GPF Loan","RPMF/RGHS","SIP","SIL","LIC","GIS","GPF04","Income tax","Total ded.","NET PAY","Bill No.","TV. No.",{"$nulls":3},{"$f":"AA10/31*16","v":26183.74193548387},null,null,{"$f":"AF10/31*15","v":{"$error":"#N/A"}},{"$f":"ROUND(AF12,0)","v":{"$error":"#N/A"}},{"$f":"AF10/31*0","v":{"$error":"#N/A"}},{"$nulls":4},10,53900,31,26080.645161290322,26081,8085]
[null,1,"2021-03-01",{"$f":"BA13","v":52300},{"$f":"IF(I3=\"REGULAR\",ROUND((D13*17/100),0),0)","v":8891},{"$f":"IF($I$3=\"REGULAR\",ROUND((D13*8%),0),0)","v":4184},{"$f":"IF($L$5=\"yes\",600,\"\")","v":""},0," "," ",{"$f":"SUM(D13:J13)","v":65375},{"$f":"IF($W$2=\"yes\",AB13,IF($W$2=\"no\",\"  \"))","v":6119},0,0,{"$f":"IF($W$2=\"no\",$AJ$26,\"  \")","v":"  "},7000,0,1070,null,null,0,{"$f":"SUM(L13:U13)","v":14189},{"$f":"K13-V13","v":51186},"111/1-4-20","45/4-4-2020",null,{"$f":"K13","v":65375},{"$f":"ROUND(((D13+E13)*10/100),0)","v":6119},{"$f":"(AA10/31)*5","v":8182.41935483871},{"$f":"ROUND(AC13,0)","v":8182},"TEACHER",3,"B",null,{"$f":"IF(W2=\"YES\",\" \",AJ25)","v":" "},{"$nulls":3},11,53900,30,26950,26950,8355,{"$nulls":8},{"$f":"W9","v":52300}]
[null,2,"2021-04-01",{"$f":"BA14","v":52300},{"$f":"IF($I$3=\"REGULAR\",ROUND((D14*17/100),0),0)","v":8891},{"$f":"IF($I$3=\"REGULAR\",ROUND((D14*8%),0),0)","v":4184},{"$f":"IF($L$5=\"yes\",600,\"\")","v":""},{"$nulls":3},{"$f":"SUM(D14:J14)","v":65375},{"$f":"IF($W$2=\"yes\",AB14,IF($W$2=\"no\",\"  \"))","v":6119},{"$f":"M13","v":0},null,{"$f":"IF($W$2=\"no\",$AJ$26,\"  \")","v":"  "},{"$f":"P13","v":7000},{"$f":"Q13","v":0},1070,220,null,{"$f":"U13","v":0},{"$f":"SUM(L14:U14)","v":14409},{"$f":"K14-V14","v":50966},{"$nulls":3},{"$f":"K14","v":65375},{"$f":"ROUND(((D14+E14)*10/100),0)","v":6119},{"$f":"(AA10/31)*3","v":4909.451612903225},{"$f":"ROUND(AC14,0)","v":4909},"SR.TEACHER",3,"B",null,{"$f":"IF($W$3=\"YES\",\" \",AJ26)","v":" "},{"$nulls":3},12,53900,31,26080.645161290322,26081,8085,{"$nulls":8},{"$f":"W9","v":52300}]
[null,3,"2021-05-01",{"$f":"BA15","v":52300},{"$f":"IF($I$3=\"REGULAR\",ROUND((D15*17/100),0),0)","v":8891},4184,"",{"$nulls":3},65375,6119,0,null,"  ",7000,0,1070,null,null,0,{"$f":"SUM(L15:U15)","v":14189},{"$f":"K15-V15","v":51186},{"$nulls":3},65375,6119,{"$f":"(AA10/31)*2","v":3272.967741935484},3273,"LECTURER",5,"A",null,{"$f":"IF(W4=\"YES\",\" \",AJ27)","v":{"v":330,"d":"330.00"}},{"$nulls":17},{"$f":"BA14","v":52300},{"$nulls":23},{"$f":"D16","v":52300}]
{"$rows_left_out":51}
{"sheet":"7pay matrix chart","index":2,"n_rows":48,"n_cols":31,"rows_kept":48,"merged":[[0,0,0,24],[0,25,0,30],[1,0,1,24],[1,25,1,30],[2,0,3,0],[2,1,3,9],[2,10,3,13],[2,14,3,20],[2,21,3,24],[2,25,6,25],[2,26,6,26],[2,27,6,27],[2,28,6,28],[2,29,6,29],[2,30,6,30],[22,23,25,24],[26,21,26,24],[27,21,27,22],[28,21,28,22],[29,21,29,22],[30,21,30,22],[31,21,31,22],[31,25,31,28],[32,21,32,22],[32,25,32,26],[33,21,33,22],[33,25,33,26],[34,21,34,22],[34,25,34,26],[35,21,35,22],[35,25,35,26],[36,21,36,22],[36,25,36,26],[37,20,39,20],[37,21,37,22],[37,25,37,26],[38,21,38,24],[38,25,38,26],[39,21,39,22],[40,19,41,20],[40,21,40,22],[41,21,41,22],[42,18,43,20],[42,21,42,22],[43,21,43,22],[44,17,44,20],[44,21,44,30],[45,16,47,20]]}
["SCHEDULE-1 PART-B RULE NO.5 VI & VII",{"$nulls":24},"SHEDULE IV  (RULE NO. 16"]
["PAY MATRIX OF STATE GOVT. SERVANTS",{"$nulls":24},"FIX REMUNERATION FOR PROBATIONER-TRAINEE"]
["EXISTING R.P. BAND","                                  PB-1                                       5200-20000",{"$nulls":8},"              PB -2                    9300-34800",{"$nulls":3},"                             PB-3                                 15600-39100",{"$nulls":6},"                 PB -4                  37400-67000",{"$nulls":3},"S.NO.","EXITING G.P.","EXITING G.P.NO.","EXITING AMOUNT OF FIXED RENUANERATION","CORRESPONDING LEVEL","FIXED REMUNERATION (WEF 01-01-17)"]
[]
["EXIST.G.P.",1700,1750,1900,2000,2400,2400,2400,2800,2800,3600,4200,4800,5400,5400,6000,6600,6800,7200,7600,8200,8700,8900,9500,10000]
["EXIST.G.P.",2,3,4,5,9,"9A","9B",10,"10A",11,12,14,15,15,16,17,18,19,20,21,22,23,"23A",24]
["LEVELS‏‏‏‏-","L-1","L-2","L-3","L-4","L-5","L-6","L-7","L-8","L-9","L-10","L-11","L-12","L-13","L-14","L-15","L-16","L-17","L-18","L-19","L-20","L-21","L-22","L-23","L-24"]
["CELL NO",{"$nulls":24},1,2,3,4,5,6]
[1,17700,17900,18200,19200,20800,21500,22400,26300,28700,33800,37800,44300,53100,56100,60700,67300,71000,75300,79900,88900,123100,129700,145800,148800,1,1700,2,6670,"L-1",12400]
[2,{"$f":"ROUND(B9+(B9*0.03),-2)","v":18200},{"$f":"ROUND(C9+(C9*0.03),-2)","v":18400},{"$f":"ROUND(D9+(D9*0.03),-2)","v":18700},19800,21400,22100,23100,27100,29600,34800,38900,45600,54700,57800,62500,69300,73100,77600,82300,91600,126800,133600,150200,153300,2,1750,3,7000,"L-2",12600]
[3,{"$f":"ROUND(B10+(B10*0.03),-2)","v":18700},19000,19300,20400,22000,22800,23800,27900,30500,35800,40100,47000,56300,59500,64400,71400,75300,79900,84800,94300,130600,137600,154700,157900,3,1900,4,7400,"L-3",12800]
[4,19300,19600,19900,21000,22700,23500,24500,28700,31400,36900,41300,48400,58000,61300,66300,73500,77600,82300,87300,97100,134500,141700,159300,162600,4,2000,5,7790,"L-4",13500]
[5,19900,20200,20500,21600,23400,24200,25200,29600,32300,38000,42500,49900,59700,63100,68300,75700,79900,84800,89900,100000,138500,146000,164100,167500,5,2400,9,7790,"L-5",14600]
[6,20500,20800,21100,22200,24100,24900,26000,30500,33300,39100,43800,51400,61500,65000,70300,78000,82300,87300,92600,103000,142700,150400,169000,172500,6,2400,"9A",8910,"L-6",15100]
[7,21100,21400,21700,22900,24800,25600,26800,31400,34300,40300,45100,52900,63300,67000,72400,80300,84800,89900,95400,106100,147000,154900,174100,177700,7,2400,"9B",8910,"L-7",15700]
{"$rows_left_out":34}
{"sheet":"TAX CALCULATION","index":3,"n_rows":28,"n_cols":13,"rows_kept":28,"merged":[[0,0,0,1],[0,3,0,6],[0,9,0,11],[1,3,1,4],[1,5,1,6],[14,0,16,1],[15,3,15,6],[16,5,16,6],[17,3,17,6]]}
["ENTER DATA IN YELLOW TAB",null,null,"TAX CACULATION",{"$nulls":5},"TAX SLAB ( YEAR 2021-22)"]
["ANNUAL GROSS SALARY",{"$f":"'GA55'!K32","v":906301},null,"OLD TAX REGIME",null,"NEW TAX REGIME  ( OPTIONAL)",{"$nulls":3},"SLAB","OPTIONAL","EXITING"]
["STANDARD DEDUCTION",50000,null,"SLAB AMOUNT (OLD)","TAX","SLAB AMOUNT (NEW)","TAX",{"$nulls":3},"NEW","OLD"]
["HRA",0,null,{"$f":"IF($B$13>250000,250000,$B$13)","v":250000},{"$f":"D4*L4","v":0},{"$f":"IF(B14>250000,250000,D13)","v":250000},{"$f":"F4*K4","v":0},null,null,"0-250000",{"v":0,"d":"0%"},{"v":0,"d":"0%"}]
["PT AND ENTERTAINMENT ALLOWANCE",544,null,{"$f":"IF($B$13>500000,250000,$B$13-D4)","v":250000},{"$f":"IF(B13<=500000,0,(D5*L5))","v":12500},{"$f":"IF($B$14>500000,250000,($B$14-F4))","v":250000},{"$f":"IF(B14<=500000,0,F5*K5)","v":12500},null,null,"250001-500000",{"v":0.05,"d":"5%"},{"v":0.05,"d":"5%"}]
["NPS",{"$f":"'GA55'!L32","v":84189},null,{"$f":"IF($B$13>750000,250000,$B$13-D5-D4)","v":121568},{"$f":"ROUND(D6*L6,0)","v":24314},{"$f":"IF($B$14>750000,250000,($B$14-F5-F4))","v":250000},{"$f":"ROUND(F6*K6,0)","v":25000},null,null,"500001-750000",{"v":0.1,"d":"10%"},{"v":0.2,"d":"20%"}]
["HOM E LOAN ITEREST",null,null,{"$f":"IF($B$13>1000000,250000,$B$13-D6-D5-D4)","v":0},{"$f":"ROUND(D7*L7,0)","v":0},{"$f":"IF($B$14>1000000,250000,($B$14-F5-F6-F4))","v":72112},{"$f":"ROUND(F7*K7,0)","v":10817},null,null,"750001-1000000",{"v":0.15,"d":"15%"},{"v":0.2,"d":"20%"}]
["DEDUCTION OG US 80C",150000,null,{"$f":"IF($B$13>1250000,250000,$B$13-D7-D6-D5-D4)","v":0},0,{"$f":"IF($B$14>1250000,250000,($B$14-F6-F7-F5-F4))","v":0},0,null,null,"1000001-1250000",{"v":0.2,"d":"20%"},{"v":0.3,"d":"30%"}]
["HEALTH  INSURANCE US 80D",null,null,{"$f":"IF($B$13>1500000,250000,$B$13-D8-D7-D6-D5-D4)","v":0},0,{"$f":"IF($B$14>1250000,250000,($B$14-F7-F8-F6-F5-F4))","v":0},0,null,null,"1250001-1500000",{"v":0.25,"d":"25%"},{"v":0.3,"d":"30%"}]
["SAVING BANK INTEREST",0,null,{"$f":"IF($B$13>1500000,$B$13-1500000,0)","v":0},0,{"$f":"IF($B$14>1500000,$B$14-1500000,0)","v":0},0,null,null,"1500000 & ABOVE",{"v":0.3,"d":"30%"},{"v":0.3,"d":"30%"}]
["80U",0]
["TOAL EXEMPTION & DEDUCTION",{"$f":"B3+B4+B5+B6+B7+B8+B9+B10+B11","v":284733},null,"TOTAL",{"$f":"ROUND(SUM(E4:E11),0)","v":36814},null,{"$f":"SUM(G4:G11)","v":48317}]
["TEXABLE INCOME for exiting slab",{"$f":"B2-B12","v":621568},null,"S.& EDU.TAX",{"$f":"ROUND(E12*4/100,0)","v":1473},{"$f":"-D18","v":0},{"$f":"ROUND(G12*4/100,0)","v":1933}]
["In new income tax nps exemption",{"$f":"B2-B6","v":822112},null,{"$f":"SUM(D4:D11)","v":621568},{"$f":"ROUND(E12+E13,0)","v":38287},{"$f":"SUM(F4:F11)","v":822112},{"$f":"ROUND((G12+G13),0)","v":50250}]
["पीले CELL में कटौती लिखे                           ध्यान रहे एक बार NEW TAX REGIME लेने पर आगामी वर्षों में यही रहेगा ",null,null,"TOTAL TAX",{"$f":"ROUND(E14,0)","v":38287},"TOTAL TAX",{"$f":"ROUND(G14,0)","v":50250}]
{"$rows_left_out":14}
{"sheet":"OLD TAX REGIME","index":4,"n_rows":67,"n_cols":13,"rows_kept":67,"merged":[[0,1,0,12],[1,1,1,9],[1,10,1,12],[2,4,2,6],[2,8,2,9],[2,11,2,12],[3,3,3,4],[3,5,3,7],[3,8,3,9],[3,10,3,12],[4,3,4,10],[5,3,5,10],[6,3,6,10],[7,1,8,1],[7,3,7,9],[7,12,8,12],[8,3,8,9],[9,3,9,10],[10,1,12,1],[10,7,10,8],[10,12,12,12],[11,3,12,4],[11,5,11,6],[11,7,11,8],[12,5,12,6],[12,7,12,8],[13,3,13,10],[14,1,27,1],[14,3,14,10],[15,3,15,4],[15,7,15,9],[15,12,23,12],[16,3,16,4],[16,7,16,9],[17,3,17,4],[17,7,17,9],[18,3,18,4],[18,7,18,9],[19,3,19,4],[19,7,19,9],[20,3,20,4],[20,7,20,9],[21,3,21,4],[21,7,21,9],[22,3,22,4],[22,7,22,9],[23,3,23,4],[23,6,23,9],[24,2,24,11],[25,2,25,10],[26,2,26,10],[27,2,27,10],[28,1,28,12],[29,1,36,1],[29,3,29,10],[30,3,30,10],[31,3,31,10],[32,3,32,10],[33,3,33,10],[34,3,34,10],[35,3,35,10],[36,3,36,10],[37,1,37,10],[38,2,38,10],[39,2,39,10],[40,2,40,10],[41,2,41,7],[41,8,41,10],[42,1,47,1],[42,2,42,6],[42,8,42,10],[43,2,43,6],[43,8,43,10],[44,2,44,6],[44,8,44,10],[45,2,45,6],[45,8,45,10],[46,2,46,6],[46,8,46,10],[47,2,47,6],[47,8,47,10],[48,2,48,7],[48,8,48,10],[49,2,49,10],[50,1,50,10],[51,1,51,10],[52,1,52,10],[53,1,53,10],[54,1,54,10],[55,1,55,12],[56,2,56,4],[56,6,56,8],[56,9,56,10],[56,12,58,12],[57,2,57,4],[57,6,57,8],[57,9,57,10],[58,2,58,4],[58,6,58,8],[58,9,58,10],[59,2,59,4],[59,6,59,8],[59,9,59,10],[60,2,60,4],[60,6,60,8],[60,9,60,10],[60,12,61,12],[61,2,61,4],[61,6,61,8],[61,9,61,10],[62,2,62,10],[63,2,63,10],[64,2,64,10],[66,3,66,5],[66,10,66,12],[69,3,69,5]]}
[null,{"$f":"'GA55'!B7","v":"OFFICE GOVT.SR.SEC.SCHOOL ALNIYAWAS DISTT.-NAGAUR"}]
[null,"आयकर गणना प्रपत्र 2021-22 ( कर निर्धारण वर्ष 2022-23)",{"$nulls":8},"OLD TAX REGIME"]
[null,1,null,"नाम कर्मचारी",{"$f":"'GA55'!D9","v":"VIJAY KUMAR PRAJAPAT"},null,null,"पद",{"$f":"'GA55'!J9","v":"lecturer"},null,"PAN NO",{"$f":"'GA55'!O9","v":"QYPP0000J"}]
[{"$nulls":3},"Bank Ac.No.--",null,{"$f":"'GA55'!W10","v":61000000000},null,null,"Name Of Bank :",null,{"$f":"'GA55'!M10","v":"STATE BANK OF INDIA RIYAN BARI"}]
[null,2,null,"कुल वेतन (कर योग्य सुविधाओ सहित NPS सहित )",{"$nulls":7},"Rs.",{"$f":"'GA55'!AU28","v":{"v":990490,"d":"990490.00"}}]
[null,3,null,"ग्रह किराया धारा 10(13-I) के अंतर्गतएंव धारा 10(14) के अंतर्गतअन्यभत्ते जो करमुक्त हो",{"$nulls":7},"Rs.",{"$f":"IF('GA55'!W6=\"YES\",'GA55'!F32,0)","v":{"v":57639,"d":"57639.00"}}]
[null,4,null,"शेष (2-3) -WITH EXEMPT STANDARD DEDUCTION MAX. 50000",{"$nulls":7},"Rs.",{"$f":"M5-M6-50000","v":{"v":882851,"d":"882851.00"}}]
[null,5,null,"(i) मनोरंजन भत्ता धारा 16(i) के अंतर्गत ( अधिकतम सीमा रू 5000 )",{"$nulls":6},{"v":0,"d":"0.00"},"Rs."]
[{"$nulls":3},"(ii)  व्यवसाय कर धारा 16(ii) के अंतर्गत ( अधिकतम सीमा रू 5000 )",{"$nulls":6},{"v":0,"d":"0.00"},"Rs."]
[null,6,null,"शेष (4-5) ",{"$nulls":7},"Rs.",{"$f":"M7-K8-K9","v":{"v":882851,"d":"882851.00"}}]
[null,7,null,"(अ) ग्रह सम्पति से आय (1) स्वंय के उपयोग में - शून्य",{"$nulls":5},"(2) प्राप्त किराया रू",null,"Rs."]
[{"$nulls":3},"(ब) घटाए",null,"किराये का 30%",null,"ग्रह ऋण पर ब्याज",null,"गृहकर","योग 7 (ब)","Rs."]
[{"$nulls":5},{"v":0,"d":"0.00"},null,{"v":0,"d":"0.00"},null,{"v":0,"d":"0.00"},{"$f":"F13+H13+I13+J13+G13","v":{"v":0,"d":"0.00"}},"Rs."]
[{"$nulls":3},"कुल सकल आय",{"$nulls":7},"Rs.",{"$f":"M10-K13","v":{"v":882851,"d":"882851.00"}}]
[null,8,"(A)","Chapter VI A Deductions( max 150000) ",{"$nulls":7},"Rs."]
{"$rows_left_out":53}
{"sheet":"NEW TAX REGIME","index":5,"n_rows":68,"n_cols":13,"rows_kept":68,"merged":[[0,1,0,12],[1,1,1,9],[1,10,1,12],[2,4,2,6],[2,8,2,9],[2,11,2,12],[3,3,3,4],[3,5,3,7],[3,8,3,9],[3,10,3,12],[4,3,4,10],[5,3,5,10],[6,3,6,10],[7,1,8,1],[7,3,7,9],[7,12,8,12],[8,3,8,9],[9,3,9,10],[10,1,12,1],[10,7,10,8],[10,12,12,12],[11,3,12,4],[11,5,11,6],[11,7,11,8],[12,5,12,6],[12,7,12,8],[13,3,13,10],[14,1,27,1],[14,3,14,10],[15,3,15,4],[15,7,15,9],[15,12,23,12],[16,3,16,4],[16,7,16,9],[17,3,17,4],[17,7,17,9],[18,3,18,4],[18,7,18,9],[19,3,19,4],[19,7,19,9],[20,3,20,4],[20,7,20,9],[21,3,21,4],[21,7,21,9],[22,3,22,4],[22,7,22,9],[23,3,23,4],[23,6,23,9],[24,2,24,11],[25,2,25,10],[26,2,26,10],[27,2,27,10],[28,1,28,12],[29,1,36,1],[29,3,29,10],[30,3,30,10],[31,3,31,10],[32,3,32,10],[33,3,33,10],[34,3,34,10],[35,3,35,10],[36,3,36,10],[37,1,37,10],[38,2,38,10],[39,2,39,10],[40,2,40,10],[41,2,41,7],[41,8,41,10],[42,1,48,1],[42,2,42,6],[42,8,42,10],[43,2,43,6],[43,8,43,10],[44,2,44,6],[44,8,44,10],[45,2,45,6],[45,8,45,10],[46,2,46,6],[46,8,46,10],[47,2,47,6],[47,8,47,10],[48,2,48,6],[48,8,48,10],[49,2,49,7],[49,8,49,10],[50,2,50,10],[51,1,51,10],[52,1,52,10],[53,1,53,10],[54,1,54,10],[55,1,55,10],[56,1,56,12],[57,2,57,4],[57,6,57,8],[57,9,57,10],[57,12,59,12],[58,2,58,4],[58,6,58,8],[58,9,58,10],[59,2,59,4],[59,6,59,8],[59,9,59,10],[60,2,60,4],[60,6,60,8],[60,9,60,10],[61,2,61,4],[61,6,61,8],[61,9,61,10],[61,12,62,12],[62,2,62,4],[62,6,62,8],[62,9,62,10],[63,2,63,10],[64,2,64,10],[65,2,65,10],[67,10,67,12]]}
[null,{"$f":"'GA55'!B7","v":"OFFICE GOVT.SR.SEC.SCHOOL ALNIYAWAS DISTT.-NAGAUR"}]
[null,"आयकर गणना प्रपत्र 2021-22 ( कर निर्धारण वर्ष 2022-23)",{"$nulls":8},"NEW TAX REGIME"]
[null,1,null,"नाम कर्मचारी",{"$f":"'GA55'!D9","v":"VIJAY KUMAR PRAJAPAT"},null,null,"पद",{"$f":"'GA55'!J9","v":"lecturer"},null,"PAN NO",{"$f":"'GA55'!O9","v":"QYPP0000J"}]
[{"$nulls":3},"Bank Ac.No.--",null,{"$f":"'GA55'!W10","v":61000000000},null,null,"Name Of Bank :",null,{"$f":"'GA55'!M10","v":"STATE BANK OF INDIA RIYAN BARI"}]
[null,2,null,"कुल वेतन (कर योग्य सुविधाओ सहित NPS सहित )",{"$nulls":7},"Rs.",{"$f":"'GA55'!AU28","v":{"v":990490,"d":"990490.00"}}]
[null,3,null,"ग्रह किराया धारा 10(13-I) के अंतर्गतएंव धारा 10(14) के अंतर्गतअन्यभत्ते जो करमुक्त हो",{"$nulls":7},"Rs.",{"v":0,"d":"0.00"}]
[null,4,null,"शेष (2-3) -WITH EXEMPT STANDARD DEDUCTION MAX. 50000",{"$nulls":7},"Rs.",{"$f":"M5-M6-50000","v":{"v":940490,"d":"940490.00"}}]
[null,5,null,"(i) मनोरंजन भत्ता धारा 16(i) के अंतर्गत ( अधिकतम सीमा रू 5000 )",{"$nulls":6},{"v":0,"d":"0.00"},"Rs."]
[{"$nulls":3},"(ii)  व्यवसाय कर धारा 16(ii) के अंतर्गत ( अधिकतम सीमा रू 5000 )",{"$nulls":6},{"v":0,"d":"0.00"},"Rs."]
[null,6,null,"शेष (4-5) ",{"$nulls":7},"Rs.",{"$f":"M7-K8-K9","v":{"v":940490,"d":"940490.00"}}]
[null,7,null,"(अ) ग्रह सम्पति से आय (1) स्वंय के उपयोग में - शून्य",{"$nulls":5},"(2) प्राप्त किराया रू",null,"Rs."]
[{"$nulls":3},"(ब) घटाए",null,"किराये का 30%",null,"ग्रह ऋण पर ब्याज",null,"गृहकर","योग 7 (ब)","Rs."]
[{"$nulls":5},{"v":0,"d":"0.00"},null,{"v":0,"d":"0.00"},null,{"v":0,"d":"0.00"},{"$f":"F13+H13+I13+J13+G13","v":{"v":0,"d":"0.00"}},"Rs."]
[{"$nulls":3},"कुल सकल आय",{"$nulls":7},"Rs.",{"$f":"M10-K13","v":{"v":940490,"d":"940490.00"}}]
[null,8,"(A)","Chapter VI A Deductions( max 150000) ",{"$nulls":7},"Rs."]
{"$rows_left_out":54}
{"sheet":"PAY SLIP","index":6,"n_rows":46,"n_cols":17,"rows_kept":46,"merged":[[0,1,0,9],[1,1,1,9],[2,1,2,2],[2,3,2,9],[3,1,3,2],[3,3,3,5],[3,6,3,7],[3,8,3,9],[4,4,4,6],[5,1,5,3],[5,6,5,7],[7,2,7,5],[7,6,7,7],[7,8,7,9],[9,1,9,3],[9,6,9,8],[11,1,11,2],[11,3,11,5],[11,7,11,9],[13,1,13,3],[13,6,13,7],[13,8,13,9],[15,1,15,2],[15,3,15,5],[15,7,15,9],[17,1,17,3],[17,6,17,8],[19,1,19,2],[19,3,19,9],[21,1,22,4],[21,6,22,9],[22,5,31,5],[23,1,23,2],[23,3,23,4],[23,6,23,7],[23,8,23,9],[24,1,24,2],[24,3,24,4],[24,6,24,7],[24,8,24,9],[25,1,25,2],[25,3,25,4],[25,6,25,7],[25,8,25,9],[26,1,26,2],[26,3,26,4],[26,6,26,7],[26,8,26,9],[27,1,27,2],[27,3,27,4],[27,6,27,7],[27,8,27,9],[28,1,28,2],[28,3,28,4],[28,6,28,7],[28,8,28,9],[29,1,29,2],[29,3,29,4],[29,6,29,7],[29,8,29,9],[30,1,30,2],[30,3,30,4],[30,6,30,7],[30,8,30,9],[31,1,31,2],[31,3,31,4],[31,6,31,7],[31,8,31,9],[32,1,33,2],[32,3,33,4],[32,6,32,7],[32,8,32,9],[33,6,33,7],[33,8,33,9],[34,1,34,4],[34,6,34,9],[35,3,35,4],[36,3,36,4],[36,5,36,6],[37,1,37,2],[37,3,37,9],[43,1,43,5],[43,6,43,9],[45,1,45,2],[45,3,45,4]]}
[null,"वेतन पर्ची"]
[null,"Pay Slip"]
[null,"DDO   OFFICE   : ",null,{"$f":"'GA55'!B7","v":"OFFICE GOVT.SR.SEC.SCHOOL ALNIYAWAS DISTT.-NAGAUR"}]
[null,"TV NO.& DATE :",null,{"$f":"VLOOKUP(E5,'GA55'!C13:Y31,23,0)","v":0},null,null,"BILL NO. & DATE :",null,{"$f":"VLOOKUP(E5,'GA55'!C13:Y24,22,0)","v":0}]
[{"$nulls":3},"Month :","2021-08-01",{"$nulls":11},{"$f":"'GA55'!C13","v":"2021-03-01"}]
[null,"कर्मचारी का नाम",{"$nulls":4},"पदनाम",{"$nulls":9},{"$f":"'GA55'!C14","v":"2021-04-01"}]
[{"$nulls":16},{"$f":"'GA55'!C15","v":"2021-05-01"}]
[null,"NAME",{"$f":"'GA55'!D9","v":"VIJAY KUMAR PRAJAPAT"},{"$nulls":3},"Designation :",null,{"$f":"'GA55'!J9","v":"lecturer"},{"$nulls":7},{"$f":"'GA55'!C16","v":"2021-06-01"}]
[{"$nulls":16},{"$f":"'GA55'!C17","v":"2021-07-01"}]
[null,"कर्मचारी पहचान संख्या",{"$nulls":4},"बैंक खाता संख्या",{"$nulls":9},{"$f":"'GA55'!C18","v":"2021-08-01"}]
[{"$nulls":16},{"$f":"'GA55'!C19","v":"2021-09-01"}]
[null,"Emp. Id",null,{"$f":"'GA55'!W11","v":"RJNA0000000000"},null,null,"A/C. No.",{"$f":"'GA55'!W10","v":61000000000},{"$nulls":8},{"$f":"'GA55'!C20","v":"2021-10-01"}]
[{"$nulls":16},{"$f":"'GA55'!C21","v":"2021-11-01"}]
[null,"जीपीएफ",{"$nulls":4},"एसआई नम्बर",{"$nulls":9},{"$f":"'GA55'!C22","v":"2021-12-01"}]
[{"$nulls":16},{"$f":"'GA55'!C23","v":"2022-01-01"}]
{"$rows_left_out":31}