{"text_format":"3","workbook":"xlsx","n_sheets":7,"sheets":["About","Entry","FIX ARREAR","Proba Fixa","Notional Fixation","HRA","GA 92"],"not_rendered":{"macros":1,"external_links":1,"defined_names":125},"read":"whole","date_system":"1900"}

{"sheet":"About","index":0,"n_rows":281,"n_cols":74,"rows_kept":281,"merged":[[0,1,0,2],[1,0,3,3],[4,0,9,3],[10,0,13,3],[12,14,15,14],[12,15,12,17],[12,18,15,18],[12,19,12,21],[13,16,15,16],[13,19,15,19],[13,20,15,20],[13,21,15,21],[14,0,17,3],[18,0,21,3],[22,0,23,3],[33,0,33,1],[33,2,33,3],[52,13,52,18],[52,19,52,24],[52,25,52,30],[52,31,52,36],[272,6,279,11]]}
[null,"ABOUT  FILE",{"$nulls":18},"Due Pay Calculation",{"$nulls":4},"Drawn Pay Calculation",null,null,"Mannual"]
["Developed By Vijay Ranwa, Teacher, Govt. Sen. Sec. School, Dhaneru,   Bikaner",{"$nulls":3},"Ded& Allow",null,null,"DA Updation",{"$nulls":3},"Pay Calculation",null,null,{"$f":"P2","v":"2007-01-01"},39083,null,{"$f":"M7","v":"2021-02-05"},null,"Sancd Dt",{"$f":"Z4","v":"2021-02-01"},{"$f":"M17","v":1020},{"$f":"M13","v":10},{"$f":"SUM(V2:W2)","v":1030},null,"Date","Mannual Amt"]
[{"$nulls":4},{"$f":"Entry!B14","v":"DA"},{"$f":"Entry!C14","v":"Y"},null,{"$f":"Entry!K6","v":"2017-01-01"},{"$f":"Entry!L6","v":4},{"$f":"Entry!M6","v":0},65,{"$nulls":5},{"$f":"IF(S3=\"\",0,1)","v":0},"2015-07-01",{"$f":"IF(R3>M$5,\"\",IF(R$2<R3,R3,\"\"))","v":""},1,{"$f":"IF(ISNA(VLOOKUP(T3,Q$2:S$10,3,FALSE)),\"\",VLOOKUP(T3,Q$2:S$10,3,FALSE))","v":"2021-07-01"},{"$f":"IF(U3=\"\",\"\",ROUNDUP((ROUND((M17+M13)*(3%),0)),-1)+M17)","v":1060},{"$f":"IF(OR(V3=\"\",V3=0),0,M$13)","v":10},{"$f":"SUM(V3:W3)","v":1070},{"$nulls":6},{"$f":"AA3","v":0}]
[{"$nulls":4},{"$f":"Entry!B15","v":"HRA"},{"$f":"Entry!C15","v":8},{"$f":"IF(F4=8,0.08,IF(F4=16,1.6,0))","v":0.08},{"$f":"Entry!K7","v":"2017-07-01"},{"$f":"Entry!L7","v":5},{"$f":"Entry!M7","v":0},null,"Arrear From",{"$f":"Entry!D$12","v":"2021-02-05"},{"$nulls":3},{"$f":"IF(S4=\"\",0,(Q3+1))","v":0},"2016-07-01",{"$f":"IF(R4>M$5,\"\",IF(R$2<R4,R4,\"\"))","v":""},2,{"$f":"IF(ISNA(VLOOKUP(T4,Q$2:S$10,3,FALSE)),\"\",VLOOKUP(T4,Q$2:S$10,3,FALSE))","v":""},{"$f":"IF(U4=\"\",\"\",ROUNDUP((ROUND((V3+W3)*(3%),0)),-1)+V3)","v":""},{"$f":"IF(OR(V4=\"\",V4=0),0,M$13)","v":0},{"$f":"SUM(V4:W4)","v":0},1,{"$f":"IF(AC2=\"\",IF(P2>R2,P2,((R2-((DAY(R2)-(1)))))),AC2)","v":"2021-02-01"},{"$f":"IF(P2>R2,P2,R2)","v":"2021-02-05"},{"$nulls":3},{"$f":"IF(AD2=\"\",P19,AD2)","v":33800}]
["                                      MS Excel esa ;g ,d esØks ;qDr Qkby gS ftlds }kjk ekg fnlEcj 2020 rd dk izkscs'ku iw.kZ gksus ds ckn LFkkbZdj.k ,fj;j cuk;k tk ldrk gS A blds mi;ksx ls iwoZ fnukad QkesZV \"dd/mm/yyyy\" djuk vko';d gS rkfd lgh x.kuk gks lds A blds ckn ,Mªsl ckj ds Åij vkI'ku dks fDyd dj esØks ,uscy fd;k tkuk gS A lacaf/kr  dkye esa okafNr lwpuk Hkjsa A            \n",{"$nulls":3},{"$f":"Entry!B16","v":"CCA"},{"$f":"Entry!C16","v":"N"},{"$f":"IF(F4=8,9,IF(F4=16,18,0))","v":9},{"$f":"Entry!K8","v":"2018-01-01"},{"$f":"Entry!L8","v":7},{"$f":"Entry!M8","v":0},null,"upto",{"$f":"Entry!G12","v":"2021-08-31"},{"$nulls":3},0,"2017-07-01","",3,{"$f":"IF(ISNA(VLOOKUP(T5,Q$2:S$10,3,FALSE)),\"\",VLOOKUP(T5,Q$2:S$10,3,FALSE))","v":""},{"$f":"IF(U5=\"\",\"\",ROUNDUP((ROUND((V4+W4)*(3%),0)),-1)+V4)","v":""},0,0,2,{"$f":"IF(AC$3=\"\",(IF(V3=\"\",\"\",U3)),AC3)","v":"2021-07-01"},{"$f":"DAY(AA4)","v":5},{"$nulls":3},{"$f":"IF(Z5=\"\",0,IF(Z5<>1,(ROUND(ROUND(AE4*3%,0),-2)+AE4),AD3))","v":34800}]
[{"$nulls":4},{"$f":"Entry!B17","v":0},{"$f":"Entry!C17","v":0},{"$f":"IF(F4=8,8,IF(F4=16,16,0))","v":8},{"$f":"Entry!K9","v":"2018-07-01"},{"$f":"Entry!L9","v":9},{"$f":"Entry!M9","v":0},{"$nulls":6},0,"2018-07-01","",4,{"$f":"IF(ISNA(VLOOKUP(T6,Q$2:S$10,3,FALSE)),\"\",VLOOKUP(T6,Q$2:S$10,3,FALSE))","v":""},"",0,0,3,{"$f":"IF(AC$3=\"\",(IF(V4=\"\",\"\",U4)),AC4)","v":""},{"$f":"MONTH(AA4)","v":2},{"$f":"(LOOKUP(AA6,{1,2,3,4,5,6,7,8,9,10,11,12},{31,28,31,30,31,30,31,31,30,31,30,31}))+(IF(AA6=2,AB7,0))","v":28},null,null,{"$f":"IF(Z6=\"\",0,IF(Z6<>1,(ROUNDUP(ROUND(AE5*3%,0),-1)+AE5),AD4))","v":0}]
[{"$nulls":4},{"$f":"Entry!B18","v":0},null,null,{"$f":"Entry!K10","v":"2019-01-01"},{"$f":"Entry!L10","v":12},{"$f":"Entry!M10","v":0},null,"Sancd Date",{"$f":"Entry!D$9","v":"2021-02-05"},{"$nulls":3},0,"2019-07-01","",5,{"$f":"IF(ISNA(VLOOKUP(T7,Q$2:S$10,3,FALSE)),\"\",VLOOKUP(T7,Q$2:S$10,3,FALSE))","v":""},"",0,{"$f":"SUM(V7:W7)","v":0},4,"",{"$f":"YEAR(AA4)","v":2021},{"$f":"IF(AA7=2008,1,IF(AA7=2012,1,0))","v":0},null,null,0]
[{"$nulls":4},{"$f":"Entry!B19","v":0},null,null,{"$f":"Entry!K13","v":"2022-01-01"},{"$f":"Entry!L13","v":0},{"$f":"Entry!M11","v":0},null,"DrawnPayOn",{"$nulls":4},0,"2020-07-01","",6,"","",0,0,5,"",{"$nulls":4},0]
[{"$nulls":7},{"$f":"Entry!K14","v":"2022-07-01"},{"$f":"Entry!L14","v":0},{"$f":"Entry!M13","v":0},{"$f":"IF(I9=0,0,I3)","v":0},"Sancd Date",{"$f":"IF(Entry!H10=\"\",Q34,Entry!H10)","v":33800},{"$nulls":3},1,"2021-07-01","2021-07-01",7,"","",0,0,6,"",null,{"$f":"AB6-(AA5-1)","v":24},null,null,0]
[{"$nulls":7},{"$f":"Entry!K15","v":"2023-01-01"},{"$f":"Entry!L15","v":0},{"$f":"Entry!M14","v":0},null,"Grade Pay",{"$f":"Entry!F$10","v":0},{"$nulls":3},0,"2022-07-01","",8,"","",0,0,7,"",{"$nulls":4},0]
{"$rows_left_out":212}
{"sheet":"Entry","index":1,"n_rows":26,"n_cols":22,"rows_kept":26,"merged":[[1,1,1,12],[2,1,2,9],[2,10,2,11],[3,3,3,9],[3,10,3,11],[4,3,4,9],[5,3,5,5],[5,6,6,9],[6,3,6,5],[7,3,7,9],[8,1,8,2],[8,5,8,6],[9,1,9,6],[9,7,9,8],[10,1,10,2],[11,1,11,2],[11,4,11,5],[12,1,12,2],[12,3,12,5],[12,6,12,7],[12,8,12,9],[13,4,13,5],[13,6,13,7],[13,8,13,9],[14,4,14,5],[14,6,14,7],[14,8,14,9],[15,4,15,5],[15,6,15,7],[15,8,15,9],[16,4,16,5],[16,6,16,7],[16,8,16,9],[17,4,17,5],[17,6,17,7],[17,8,17,9]]}
[]
[null,"This Program made by Vijay Ranwa, Teacher Govt sen. Sec. School DHANERU"]
[null,"Pay Fixtation Arrear For State Employees , PLEASE Fill Required INFORMATION",{"$nulls":8},"D A UPDATION"]
[null,"dk;kZy;",null,"dk;kZy;] iz/kkukpk;Z ,oa ih-bZ-bZ-vks-] jktdh; mPp ek/;fed fo|ky; /kus:] chdkusj",{"$nulls":6}," DA REVISION"]
[{"$nulls":10},"MONTH","RATE"]
[null,"deZpkjh dk uke",null,"fot;",null,null,"VIJAY RANWA MO. 9828113904",{"$nulls":3},"2017-01-01",4]
[null,"in",null,"v/;kid",{"$nulls":6},"2017-07-01",5]
[null,"inLFkkiu LFkku",null,"jkmekfo] /kus:",{"$nulls":6},"2018-01-01",7]
[null,"LFkkbZdj.k fnukad",null,"2021-02-05",null,"Lohd`r is esfVªd ysoy",null,10,null,null,"2018-07-01",9]
[null,";fn uks'kuy ykHk feyk gS rks izkscs'ku iw.kZ Ik'pkr ftl csfld ij fQDl fd;k gS oks csfld QhM djsA vU;Fkk dkWye [kkyh jgus nsaA",{"$nulls":8},"2019-01-01",12]
{"$rows_left_out":9}
{"sheet":"FIX ARREAR","index":2,"n_rows":111,"n_cols":26,"rows_kept":111,"merged":[[0,2,0,23],[1,1,1,15],[1,18,1,19],[1,20,1,21],[1,22,1,23],[3,9,3,12],[3,13,3,19],[3,20,3,21],[4,2,4,7],[4,8,4,15],[4,16,4,18],[4,19,4,21],[5,1,5,7],[5,8,5,15],[6,0,7,0],[6,1,7,1],[6,2,6,8],[6,9,6,13],[6,14,6,18],[6,19,6,22],[6,23,7,23],[6,24,7,24],[6,25,7,25]]}
[null,null,{"$f":"\"dk;kZy;  \"&Entry!D4","v":"dk;kZy;  dk;kZy;] iz/kkukpk;Z ,oa ih-bZ-bZ-vks-] jktdh; mPp ek/;fed fo|ky; /kus:] chdkusj"}]
[null,"LFkkbZdj.k Ik'pkr~ osru vUrj izi=",{"$nulls":14},"vo/kh",null,{"$f":"Entry!D12","v":"2021-02-05"},null,"TO",null,{"$f":"Entry!G12","v":"2021-08-31"}]
[{"$nulls":22},{"$f":"About!E18","v":"00:00:00"},{"$f":"About!F18","v":0}]
[{"$nulls":13},"PAY MATRIX LEVEL",{"$nulls":6},{"$f":"Entry!H9","v":10}]
[null,null,"deZpkjh dk uke",{"$nulls":5},{"$f":"Entry!D6","v":"fot;"},{"$nulls":7},{"$f":"Entry!B7","v":"in"},null,null,{"$f":"Entry!D7","v":"v/;kid"}]
[null,"inLFkkiu fo|ky;",{"$nulls":6},{"$f":"Entry!D8","v":"jkmekfo] /kus:"},{"$nulls":13},{"$f":"About!E24","v":"00:00:00"},{"$f":"About!F24","v":0}]
["S.N.","Month","PAY DUE",{"$nulls":6},"PAY DROWN",{"$nulls":4},"DIFFERENCE",{"$nulls":4},"Deducations",{"$nulls":3},"NET ","Bill No./Date","T.V.NO./ Incash date "]
[null,null,"Basic","DA","CCA","DA",null,"HRA","Total","Basic","DA","CCA","HRA","Total","Basic","DA","CCA","HRA","Total","NPS","SI","I TAX","Total"]
[1,{"$f":"VLOOKUP(1,About!L$55:AL$200,2,FALSE)","v":"2021-02-01"},{"$f":"IF(B9>=About!M$5,0,(IF(ISNA(VLOOKUP(B9,About!M$55:AL$200,2,FALSE)),0,(VLOOKUP(B9,About!M$55:AL$200,2,FALSE)))))","v":28971},{"$f":"IF(B9>=About!M$5,0,(IF(ISNA(VLOOKUP(B9,About!M$55:AP$200,30,FALSE)),0,(VLOOKUP(B9,About!M$55:AP$200,30,FALSE)))))","v":17},{"$f":"IF(B9>=About!M$5,0,(IF(ISNA(VLOOKUP(B9,About!M$55:AL$167,4,FALSE)),0,(VLOOKUP(B9,About!M$55:AL$167,4,FALSE)))))","v":0},{"$f":"ROUND(C9*D9/100,0)","v":4925},{"$f":"IF(B9>=About!M$5,0,(IF(ISNA(VLOOKUP(B9,About!M$55:AK$200,6,FALSE)),0,(VLOOKUP(B9,About!M$55:AK$200,6,FALSE)))))","v":8},{"$f":"ROUND(C9*G9/100,0)","v":2318},{"$f":"SUM(C9,E9,F9,H9)","v":36214},{"$f":"IF(B9>=About!M$5,0,(IF(ISNA(VLOOKUP(B9,About!M$55:BL$200,8,FALSE)),0,(VLOOKUP(B9,About!M$55:BL$200,8,FALSE)))))","v":20314},"0","0","0",{"$f":"SUM(J9:M9)","v":20314},{"$f":"C9-J9","v":8657},{"$f":"F9-K9","v":4925},{"$f":"E9-L9","v":0},{"$f":"H9-M9","v":2318},{"$f":"SUM(O9:R9)","v":15900},{"$f":"ROUND((C9+F9)*10%,0)-ROUND(J9*10%,0)","v":1359},{"$f":"IF(B9>=About!M$5,0,(IF(ISNA(VLOOKUP(B9,About!M$55:BL$200,29,FALSE)),0,(VLOOKUP(B9,About!M$55:BL$200,22,FALSE)))))","v":0},null,{"$f":"SUM(T9:V9)","v":1359},{"$f":"S9-W9","v":14541}]
[2,{"$f":"EDATE(B9,1)","v":"2021-03-01"},{"$f":"IF(B10>=About!M$5,0,(IF(ISNA(VLOOKUP(B10,About!M$55:AL$200,2,FALSE)),0,(VLOOKUP(B10,About!M$55:AL$200,2,FALSE)))))","v":33800},{"$f":"IF(B10>=About!M$5,0,(IF(ISNA(VLOOKUP(B10,About!M$55:AP$200,30,FALSE)),0,(VLOOKUP(B10,About!M$55:AP$200,30,FALSE)))))","v":17},{"$f":"IF(B10>=About!M$5,0,(IF(ISNA(VLOOKUP(B10,About!M$55:AL$167,4,FALSE)),0,(VLOOKUP(B10,About!M$55:AL$167,4,FALSE)))))","v":0},{"$f":"ROUND(C10*D10/100,0)","v":5746},{"$f":"IF(B10>=About!M$5,0,(IF(ISNA(VLOOKUP(B10,About!M$55:AK$200,6,FALSE)),0,(VLOOKUP(B10,About!M$55:AK$200,6,FALSE)))))","v":8},{"$f":"ROUND(C10*G10/100,0)","v":2704},{"$f":"SUM(C10,F10,H10)","v":42250},{"$f":"IF(B10>=About!M$5,0,(IF(ISNA(VLOOKUP(B10,About!M$55:BL$200,8,FALSE)),0,(VLOOKUP(B10,About!M$55:BL$200,8,FALSE)))))","v":23700},"0","0","0",{"$f":"SUM(J10:M10)","v":23700},{"$f":"C10-J10","v":10100},{"$f":"F10-K10","v":5746},{"$f":"E10-L10","v":0},{"$f":"H10-M10","v":2704},{"$f":"SUM(O10:R10)","v":18550},{"$f":"ROUND((C10+F10)*10%,0)-ROUND(J10*10%,0)","v":1585},{"$f":"IF(B10>=About!M$5,0,(IF(ISNA(VLOOKUP(B10,About!M$55:BL$200,29,FALSE)),0,(VLOOKUP(B10,About!M$55:BL$200,22,FALSE)))))","v":2200},null,{"$f":"SUM(T10:V10)","v":3785},14765]
{"$rows_left_out":102}
{"sheet":"Proba Fixa","index":3,"n_rows":20,"n_cols":10,"rows_kept":20,"merged":[[0,0,0,9],[1,0,1,9],[2,0,2,9],[10,7,10,8],[11,7,11,8],[18,7,18,8],[19,7,19,8]]}
[{"$f":"Entry!D4","v":"dk;kZy;] iz/kkukpk;Z ,oa ih-bZ-bZ-vks-] jktdh; mPp ek/;fed fo|ky; /kus:] chdkusj"}]
["&%% dk;kZy; vkns”k %%&"]
["                dk;kZy; ftyk f'k{kk vf/kdkjh] eq[;ky; izkjfEHkd f'k{kk] chdkusj ds vkns'k Øekad ftf'kv@izkf'k@eq-@chdk@LFkk;hdj.k ,oa os-fu-@2021@1204 fnukad 13-01-2021 dh vuqikyuk esa jkT; ljdkj dh vf/klwpuk Øekad% ,Q-1¼2½,Q-Mh@fu;e@06 fnukad 13-03-2006 ,oa ,Q-12¼6½,Q-Mh¼fu;e½@05 fnukad 13-03-2006 ds izko/kkukUrxZr 02 o\"kZ ds ifjoh{kk/khu izf'k{k.kkFkhZ ds :i esa fu;r fLFkj ekuns; ij@fo|eku osrueku esa fu;qDr fd;s x;s fuEu dkfeZd dks 02 o\"kZ dh ifjoh{kkdky vof/k larks\"kizn :i ls iw.kZ  djus ij fu;qfDr vf/kdkjh }kjk LFkkbZdj.k ,oa osru fu;fefrdj.k vkns'k tkjh djus ij jktLFkku lsok fu;e 1951 ds fu;e 24 o 26 ,oa jktLFkku flfoy lsok,a ¼iqujhf{kr osrueku½ fu;e&2017 ds Øekad ,Q-15¼1½,QMh@ :Yl@2017 fnukad 30-10-2017 ds fu;e&05¼VI & VII½ ,oa vuqlwph 1 esa vafdr la'kks/ku vkns'k 09-12-2017 ds izko/kkukuqlkj dkWye 7 esa vafdr fnukad ls osru vkSj fu;ekuqlkj ns; vU; HkRrs vkgj.k djus dh Lohd`fr ,rn~ }kjk iznku dh tkrh gSA"]
["Ø-la-","deZpkjh dk uke","in","inLFkkiu LFkku","ifjoh{kk/khu in ij dk;Zxzg.k fnukad","ifjoh{kkdky iw.kZ djus dh fnukad","osru fu;ferhdj.k fnukad","is eSfVªDl ysoy","osru fu;fefrdj.k ij ewy osru","vkxkeh osru o`f) frfFk"]
[1,2,3,4,5,6,7,8,9,10]
[1,{"$f":"Entry!D6","v":"fot;"},{"$f":"Entry!D7","v":"v/;kid"},{"$f":"Entry!D8","v":"jkmekfo] /kus:"},{"$f":"F6-730","v":"2019-02-05"},{"$f":"G6-1","v":"2021-02-04"},{"$f":"Entry!D9","v":"2021-02-05"},{"$f":"CONCATENATE(\"L-\",Entry!H9)","v":"L-10"},{"$f":"'FIX ARREAR'!C10","v":33800},"2021-07-01"]
[2]
[3]
[4]
[]
{"$rows_left_out":11}
{"sheet":"Notional Fixation","index":4,"n_rows":17,"n_cols":13,"rows_kept":17,"merged":[[0,0,0,12],[1,11,1,12],[2,0,2,12],[3,0,3,12],[4,0,5,0],[4,1,5,1],[4,2,5,2],[4,3,5,3],[4,4,5,4],[4,5,5,5],[4,6,4,7],[4,8,5,8],[4,9,5,9],[4,10,5,10],[4,11,4,12],[9,9,9,11],[10,9,10,11],[12,1,12,3],[13,1,13,3],[14,1,14,3],[15,1,15,3],[15,9,15,11],[16,9,16,11]]}
["dk;kZy;] iz/kkukpk;Z ,oa insu iapk;r izkjfEHkd f'k{kk vf/kdkjh] jktdh; mPp ek/;fed fo|ky;] /kus:] ¼JhMwaxjx<+a½"]
[null,"Øekad % ihbZbZvks@/kus:@laLFkk@osru fu;ru@2021&22@          ",{"$nulls":8},"fnukad %"]
["dk;kZy; vkns'k"]
["                          Jheku ftyk f'k{kk vf/kdkjh ¼eq[;ky;½ izkjfEHkd f'k{kk] ukxkSj ds vkns'k Øekad&f'kfouk@izkja@laLFkk&1@U;k-izdj.k@2019&20@1368 fnukad 02-03-2020 dh ikyuk esa izkFkfed ,oa mPp izkFkfed fo|ky; v/;kid HkrhZ] 2013 }kjk p;fur bl dk;kZy; v/khuLFk fuEukafdr dk;Zjr dkfeZd dks ekuuh; mPp U;k;ky;] fu.kZ;kuqlkj bu HkrhZ;ksa esa izFke ijh.kke ls p;fur ,oa fu;qDr f'k{kdksa ¼dfu\"Bre½ ds leku uks'kuy ifjykHk ,oa ofj\"Brk ykHk nsus dh Lohd`fr iznku djus ij ,oa dk;kZy; ftyk f'k{kk vf/kdkjh ¼eq[;ky;½ izkjfEHkd f'k{kk] ukxkSj ds vkns'k Øekad&f'kfouk@izkja@laLFkk&1@LFkkbZZdj.k@2020@297 fnukad 20-08-2020 ds }kjk fuEukafdr dkfeZd dks LFkkbZ djus ij budk osru fu;ru fuEukafdr fooj.kkuqlkj fd;k tkrk gSA bl uks'kuy ifjykHk dk okLrfod vkfFkZd ifjykHk v/;kid dks okLrfod dk;Zxzg.k frfFk ls nks o\"kZ dh ifjoh{kk izf'k{kq vof/k larks\"ktud :i ls iw.kZ djus ij HkrhZ fu;eksa ,oa fu;qfDr vkns'k esa vafdr 'krksZa ds vUrxZr fu;ekuqlkj ,oa ekuuh; U;k;ky; fu.kZ;kuqlkj ns; gksxkA"]
["Ø-la-","uke dkfeZd e; in","inLFkkfir fo|ky; dk uke","ekuuh; U;k;y; fu.kZ;kuqlkj dkYifud dk;Zxzg.k ¼mDr HkrhZ esa dfu\"Bre vH;FkhZ dh vafre dk;Zxzg.k frfFk½","v/;kid in ij okLrfod dk;Zxzg.k frfFk","U;k;ky; ds fu.kZ;kuqlkj ifjoh{kk/khu izf'k{k.k dky iw.kZrk mijkUr fu;fer osru 'k`a[kyk iznku fd;s tkus dh frfFk ¼dkYifud½","ns; fu;fer osru 'k`a[kyk  ¼dkYifud½",null,"okf\"kZd osru o`f) mijkUr osru 01-07-17 ¼dkYifud½","okf\"kZd osru o`f) mijkUr osru 01-07-18 ¼dkYifud½","okf\"kZd osru o`f) mijkUr osru 01-07-19 ¼dkYifud½","ifjoh{kk/khu izf'k{k.k dky iw.kZrk mijkUr ns; osru ¼okLrfod½ "]
[{"$nulls":6},"osru ysoy","ewy osru",{"$nulls":3},"fnukad","ewy osru"]
[1,{"$f":"CONCATENATE('Proba Fixa'!B6, \"] \",'Proba Fixa'!C6)","v":"fot;] v/;kid"},{"$f":"'Proba Fixa'!D6","v":"jkmekfo] /kus:"},"2015-03-30","2017-10-26","2017-03-30","L-10",33800,34800,35800,36900,"26.10.19",36900]
[]
[]
[{"$nulls":9},"iz/kkukpk;Z"]
{"$rows_left_out":8}
{"sheet":"HRA","index":5,"n_rows":22,"n_cols":8,"rows_kept":22,"merged":[[0,0,0,7],[1,6,1,7],[2,0,2,7],[3,0,3,7],[4,0,5,0],[4,1,5,1],[4,2,5,2],[4,3,5,3],[4,4,5,4],[4,5,5,5],[4,6,5,6],[12,6,12,7],[13,6,13,7],[20,6,20,7],[21,6,21,7]]}
[{"$f":"Entry!D4","v":"dk;kZy;] iz/kkukpk;Z ,oa ih-bZ-bZ-vks-] jktdh; mPp ek/;fed fo|ky; /kus:] chdkusj"}]
["Øekad %& jkmekfo@/kus:@laLFkk@ys[kk@2020&21@                       fnukad %&"]
["&%% dk;kZy; vkns”k %%&"]
["                      Jheku ftyk f'k{kk vf/kdkjh] eq[;ky; izkjfEHkd f'k{kk] chdkusj] ds vkns”k Øekad %  ftf'kv@izkf'k@eq-@chdk@LFkkbZdj.k ,oa os-fu@2021@1204 fnukad 13-01-2021 ds }kjk v/khuLFk fo|ky; esa fuEu dkfeZdksa dk LFkkbZdj.k gksus ,oa muds }kjk izLrqr vkosnu i= ds vk/kkj ij jktLFkku flfoy lsok ¼iqujhf{kr osrueku½ fu;e 2017 t;iqj fnukad 30-10-2017 ,oa lela[;d la'kksf/kr vkns'k fnukad 09-12-2017 ds edku fdjk;k HkÙkk fu;e ,Q-6¼4½,QMh¼:Yl½@2017 fnukad 30&10&2017 ,oa la'kks/ku vkns'k fnukad 22-07-2021 ds izko/kkuqlkj jktLFkku lsok fu;eksa ds fu;e 7 ¼24½¼1½ esa ifjHkkf\"kr osru ds fu;ekuqlkj edku fdjk;k HkÙkk muds uke ds lkeus vafdr fnukad ls jkT; ljdkj ds vkns'kkuqlkj izfrekg Lohd`r fd;k tkrk gSa &"]
["Ø- la-","Ukke dkfeZd o in","in","fo|ky; dk uke","edku fdjk;k HkÙkk ns; frfFk","ysoy","ewy osru","edku fdjk;k HkÙkk"]
[{"$nulls":7},{"v":0.08,"d":"8%"}]
[1,{"$f":"'Proba Fixa'!B6","v":"fot;"},{"$f":"'Proba Fixa'!C6","v":"v/;kid"},{"$f":"'Proba Fixa'!D6","v":"jkmekfo] /kus:"},{"$f":"'Proba Fixa'!G6","v":"2021-02-05"},{"$f":"'Proba Fixa'!H6","v":"L-10"},{"$f":"'Proba Fixa'!I6","v":33800},{"$f":"G7*$H$6","v":2704}]
[2,{"$f":"IF('Proba Fixa'!B7=\"\",\"\",'Proba Fixa'!B7)","v":""},{"$f":"IF('Proba Fixa'!C7=\"\",\"\",'Proba Fixa'!C7)","v":""},{"$f":"IF('Proba Fixa'!D7=\"\",\"\",'Proba Fixa'!D7)","v":""},{"$f":"IF('Proba Fixa'!G7=\"\",\"\",'Proba Fixa'!G6)","v":""},{"$f":"IF('Proba Fixa'!H7=\"\",\"\",'Proba Fixa'!H6)","v":""},{"$f":"IF('Proba Fixa'!I7=\"\",\"\",'Proba Fixa'!I6)","v":""},{"$f":"IF(G8=\"\",\"\",ROUND((G8*$H$6),0))","v":""}]
[3,{"$f":"IF('Proba Fixa'!B8=\"\",\"\",'Proba Fixa'!B8)","v":""},{"$f":"IF('Proba Fixa'!C8=\"\",\"\",'Proba Fixa'!C8)","v":""},{"$f":"IF('Proba Fixa'!D8=\"\",\"\",'Proba Fixa'!D8)","v":""},{"$f":"IF('Proba Fixa'!G8=\"\",\"\",'Proba Fixa'!G7)","v":""},{"$f":"IF('Proba Fixa'!H8=\"\",\"\",'Proba Fixa'!H7)","v":""},{"$f":"IF('Proba Fixa'!I8=\"\",\"\",'Proba Fixa'!I7)","v":""},{"$f":"IF(G9=\"\",\"\",ROUND((G9*$H$6),0))","v":""}]
[4,{"$f":"IF('Proba Fixa'!B9=\"\",\"\",'Proba Fixa'!B9)","v":""},{"$f":"IF('Proba Fixa'!C9=\"\",\"\",'Proba Fixa'!C9)","v":""},{"$f":"IF('Proba Fixa'!D9=\"\",\"\",'Proba Fixa'!D9)","v":""},{"$f":"IF('Proba Fixa'!G9=\"\",\"\",'Proba Fixa'!G8)","v":""},{"$f":"IF('Proba Fixa'!H9=\"\",\"\",'Proba Fixa'!H8)","v":""},{"$f":"IF('Proba Fixa'!I9=\"\",\"\",'Proba Fixa'!I8)","v":""},""]
{"$rows_left_out":13}
{"sheet":"GA 92","index":6,"n_rows":21,"n_cols":14,"rows_kept":21,"merged":[[0,3,1,7],[0,9,0,12],[1,9,1,12],[2,9,2,12],[3,0,3,13],[4,0,4,13],[5,0,5,13],[6,1,6,13],[7,1,7,13],[8,0,9,0],[8,1,9,1],[8,2,9,2],[8,3,9,3],[8,4,9,4],[8,5,9,5],[8,6,9,6],[8,7,9,7],[8,8,8,10],[8,11,8,12],[8,13,9,13],[20,8,20,12]]}
[null,"GA 92",null,"GOVERNMENT OF RAJASTHAN",{"$nulls":5},"New Form"]
[null,"GFAR 196 & 197",{"$nulls":7},"No. G.A. 41"]
[{"$nulls":9},"Rule 155"]
["Office Principal and ex-officio Panchayat Primary Education Officer Dhaneru"]
["Periodical Increment Certificate"]
["lkef;d osru&o`f) izek.k&i="]
[1,"Certified that the Government Servants named below have earned the prescribed perodical increments from the date cited in column 7, having been the incumbment of the posts specified for not less than …......... year from the date in column 6, after deducting periods of suspension for misconduct, etc. and absence on leave without pay and, in the case those holding the post in officiating capacity, all other kind of leave."]
[2,"Certified that the Government Servants named below have earned / will earn perodical increments from the date cited, for reasons stated in the explanatory memo, attached hereto."]
["Øe la-","o`f)&Hkksxh dk uke","LFkkbZ ;k LFkkukiUu","in ds osru dh nj","orZeku osru","fnukad ftlls orZeku osru fy;k gS","orZeku osru o``f) dk fnukad","Hkkoh osru","vuqfpr O;ogkj ds dkj.k inP;qfr vkSj ,slh vU; mifLFkfr] tks osruo`f) ds fy, vekU; gks",null,null,"voSrfud NqV~Vh vkSj LFkkukiUu vf/kdkjh ds fy, dksbZ Hkh vU; NqV~Vh",null,"fo'ks\"k fooj.k"]
[{"$nulls":8},"o.kZu","dc ls","dc rd","dc ls","dc rd"]
{"$rows_left_out":11}