{"text_format":"3","workbook":"xlsx","n_sheets":7,"sheets":["Master Sheet","GA-55","Other Deduction","Tax Old Regime","Tax New Regime","Form 16","Hra Receipt"],"not_rendered":{"images":1,"macros":1,"external_links":1,"defined_names":343},"read":"whole","date_system":"1900"}

{"sheet":"Master Sheet","index":0,"n_rows":18,"n_cols":22,"rows_kept":18,"merged":[[0,1,0,15],[0,17,9,20],[1,0,10,0],[1,1,1,2],[1,3,1,13],[2,1,2,15],[3,1,3,7],[3,8,9,8],[3,9,3,15],[4,1,4,3],[4,4,4,7],[4,9,4,11],[4,12,4,15],[5,1,5,3],[5,4,5,7],[5,9,5,11],[5,12,5,15],[6,1,6,3],[6,4,6,7],[6,9,6,11],[6,12,6,15],[7,1,7,3],[7,4,7,7],[7,9,7,15],[8,1,8,3],[8,4,8,7],[8,9,8,11],[8,12,8,15],[9,1,9,3],[9,4,9,7],[9,9,9,11],[9,12,9,15],[10,1,10,15],[10,17,11,20],[12,0,17,0],[12,1,12,6],[12,8,17,8],[12,9,12,11],[12,13,12,15],[12,17,12,20],[13,1,13,6],[13,9,13,11],[13,13,13,15],[14,1,14,6],[14,9,14,11],[14,13,14,15],[15,1,15,6],[15,13,15,15],[16,1,16,6],[16,9,17,12],[16,13,16,15],[17,1,17,6],[17,13,17,15]]}
[null,"मास्टर शीट को पूर्ण भरने के बाद SALARY SHEET व OTHER DEDUCTION वाली शीट को जरूर चेक करें।"]
[null,"OFFICE NAME",null,"GOVT. SR. SECONDARY SCHOOL, GORDHANPURA, ATRU, BARAN",{"$nulls":10},"TAN NO.","JDHG09699E",{"$nulls":5},"YES"]
[{"$nulls":21},"NO"]
[null,"EMPLOYEE INFORMATION",{"$nulls":7},"DDO INFORMATION",{"$nulls":11},{"v":0.09,"d":"9%"}]
[null,"EMPLOYEE NAME",null,null,"PARMANAND MEGHWAL",{"$nulls":4},"DDO NAME",null,null,"RAJENDRA KUMAR CHITTORA",{"$nulls":3},"YES ",{"$nulls":4},{"v":0.18,"d":"18%"}]
[null,"DESIGNATION",null,null,"SENIOR TEACHER",{"$nulls":4},"DDO FATHER'S NAME",null,null,"RAM LAL",{"$nulls":3},"NO",{"$nulls":4},4]
[null,"PAN NUMBER",null,null,"ASQPM6311G",{"$nulls":4},"DESIGNATION",null,null,"PRINCIPAL",{"$nulls":3},{"v":0.09,"d":"9%"},{"$nulls":4},5]
[null,"BANK A/C NUMBER",null,null,2225617763,{"$nulls":4},"HOUSE OWNER DETAIL (HRA RENT RECEIPT)",{"$nulls":6},{"v":0.18,"d":"18%"},{"$nulls":4},6]
[null,"MOBILE NUMBER",null,null,9784379510,{"$nulls":4},"HOUSE OWNER NAME",null,null,"RAM DAYAL NAGAR",{"$nulls":8},7]
[{"$nulls":9},"ADDRESS",null,null,"KAWAI SALPURA, ATRU BARAN",{"$nulls":8},8]
[null,"SALARY DETAIL",{"$nulls":14},4,"           PARMANAND MEGHWAL          SR. TEACHER",{"$nulls":3},9]
[{"$nulls":21},10]
[null,"क्या आप NPS (GPF-2004) के कर्मचारी हैं?",{"$nulls":5},"YES",null,"MARCH 2022 BASIC",null,null,47900,{"$nulls":8},11]
[null,"क्या आपने समर्पित वेतन लिया?",{"$nulls":5},"YES",null,"S.I.",null,null,4000,{"$nulls":8},12]
[null,"समर्पित वेतन लेने का माह ?",{"$nulls":5},8,null,"L.I.C.",null,null,2250,{"$nulls":8},1]
{"$rows_left_out":4}
{"sheet":"GA-55","index":1,"n_rows":35,"n_cols":31,"rows_kept":35,"merged":[[0,3,0,4],[0,5,0,7],[0,8,0,9],[0,10,0,13],[0,15,0,16],[0,18,0,20],[0,21,0,22],[0,23,0,26],[1,2,1,28],[2,2,2,28],[3,2,3,28],[4,3,5,7],[4,8,4,9],[4,10,4,13],[4,15,4,17],[4,20,4,22],[4,24,4,26],[4,27,4,28],[5,8,5,9],[5,12,5,19],[5,24,5,26],[5,27,5,28],[6,2,7,2],[6,3,6,13],[6,14,6,26],[6,28,7,28],[36,2,36,28]]}
[null,null,"GPF 2004",{"$f":"'Master Sheet'!H13","v":"YES"},null,"Surrender",null,null,{"$f":"'Master Sheet'!H14","v":"YES"},null,"Surrender Month",{"$nulls":3},{"$f":"'Master Sheet'!H15","v":8},"HRA",null,{"$f":"'Master Sheet'!H17","v":{"v":0.09,"d":"9%"}},"Bounus",null,null,{"$f":"'Master Sheet'!H16","v":"YES"},null,"Senior Citizen",{"$nulls":3},{"$f":"'Master Sheet'!H18","v":"YES"},null,"No","No"]
[{"$nulls":29},{"v":0.09,"d":"9%"}]
[null,null,{"$f":"'Master Sheet'!D2","v":"GOVT. SR. SECONDARY SCHOOL, GORDHANPURA, ATRU, BARAN"},{"$nulls":26},{"v":0.18,"d":"18%"}]
[null,null,"INCOME TAX CALCULATION (GA-55) 2022-23"]
[null,null,"NAME :",{"$f":"'Master Sheet'!E5","v":"PARMANAND MEGHWAL"},{"$nulls":6},{"$f":"'Master Sheet'!E6","v":"SENIOR TEACHER"},{"$nulls":3},"PAN :",{"$f":"'Master Sheet'!E7","v":"ASQPM6311G"},{"$nulls":3},"TAN:",{"$f":"'Master Sheet'!P2","v":"JDHG09699E"},{"$nulls":3},"A/C NO.",null,null,{"$f":"'Master Sheet'!E8","v":2225617763},null,"Yes","Yes"]
[{"$nulls":12},"RAJTEACHERS.NET",{"$nulls":11},"MOB NO.",null,null,{"$f":"'Master Sheet'!E9","v":9784379510},null,"No","No"]
[null,null,"Month","ALLOWANCES",{"$nulls":10},"DEDUCTIONS",{"$nulls":13},"Bill No. & T.V. No."]
[{"$nulls":3},"Basic Pay","Dearness Pay","Leave  Pay","Spl. Pay","D.A.","H.R.A.","Washing Allow.","ROP (If any, put the value in minus)","Other Allowance 1","Other Allowance 2","Gross  Salary",{"$f":"IF(D1=\"No\",\"GPF\",\"GPF 2004\")","v":"GPF 2004"},{"$f":"IF(D1=\"No\",\"GPF LOAN\",\"\")","v":""},"SI","SI LOAN + INT","RPMF/RGHS","LIC","Group Insurance  \nAccidental","HBA Premium","HBA Interest","Income Tax / TDS","HITKARI NIDHI","CM Corona Fund","Total\nDeduction","Net Payment"]
[null,3,"2022-03-01",{"$f":"'Master Sheet'!M13","v":47900},0,0,0,{"$f":"ROUND(31%*D9,0)","v":14849},{"$f":"IF($R$1=18%,ROUND(0.18*D9,0),ROUND(0.09*D9,0))","v":4311},0,0,0,0,{"$f":"SUM(D9:M9)","v":67060},{"$f":"IF(D9<23101,1450,IF(D9<28501,1625,IF(D9<38501,2100,IF(D9<51501,2850,IF(D9<62001,3575,IF(D9<72001,4200,IF(D9<80001,4800,IF(D9<116001,6150,IF(D9<167001,8900,10500)))))))))","v":2850},0,{"$f":"'Master Sheet'!M14","v":4000},0,{"$f":"IF(D9<18001,265,IF(D9<33501,440,IF(D9<54001,658,875)))","v":658},{"$f":"'Master Sheet'!M15","v":2250},0,null,null,0,null,null,{"$f":"SUM(O9:Y9)","v":9758},{"$f":"N9-AA9","v":57302},null,null,4]
[null,4,"2022-04-01",{"$f":"D9","v":47900},{"$f":"IF(E$9=0,0,ROUND(D10/2,0))","v":0},{"$f":"IF(F$9=0,0,F9)","v":0},0,{"$f":"ROUND(34%*D10,0)","v":16286},{"$f":"IF($R$1=18%,ROUND(0.18*D10,0),ROUND(0.09*D10,0))","v":4311},{"$f":"IF(J$9=0,0,J9)","v":0},{"$f":"IF(K$9=0,0,K9)","v":0},0,{"$f":"IF(M$9=0,0,M9)","v":0},{"$f":"SUM(D10:M10)","v":68497},{"$f":"IF(D10<23101,1450,IF(D10<28501,1625,IF(D10<38501,2100,IF(D10<51501,2850,IF(D10<62001,3575,IF(D10<72001,4200,IF(D10<80001,4800,IF(D10<116001,6150,IF(D10<167001,8900,10500)))))))))","v":2850},{"$f":"P9","v":0},{"$f":"Q9","v":4000},{"$f":"R9","v":0},{"$f":"IF(D10<18001,265,IF(D10<33501,440,IF(D10<54001,658,875)))","v":658},{"$f":"T9","v":2250},null,{"$f":"V9","v":0},0,{"$f":"X9","v":0},0,null,{"$f":"SUM(O10:Y10)","v":9758},58739,null,null,5]
[null,5,"2022-05-01",47900,{"$f":"IF($E$9=0,0,ROUND(D11/2,0))","v":0},0,0,{"$f":"ROUND(34%*D11,0)","v":16286},4311,0,{"$f":"IF(K$9=0,0,K10)","v":0},{"$f":"IF(L$9=0,0,L10)","v":0},0,68497,2850,{"$f":"P10","v":0},{"$f":"Q10","v":4000},{"$f":"R10","v":0},658,{"$f":"T10","v":2250},0,0,0,0,{"$f":"Y10","v":0},null,9758,58739,null,null,6]
[null,6,"2022-06-01",47900,0,0,0,16286,4311,0,0,0,0,68497,2850,0,4000,0,658,2250,0,0,0,0,{"$f":"Y11","v":0},null,9758,58739,null,null,7]
[null,7,"2022-07-01",{"$f":"MROUND(ROUND(1.03*D12,0),100)","v":49300},0,{"$f":"IF(F$9=0,0,F12)","v":0},{"$f":"IF(G$9=0,0,G12)","v":0},16762,4437,{"$f":"IF(J$9=0,0,J12)","v":0},{"$f":"IF(K$9=0,0,K12)","v":0},{"$f":"IF(L$9=0,0,L12)","v":0},{"$f":"IF(M$9=0,0,M12)","v":0},70499,2850,{"$f":"P12","v":0},{"$f":"Q12","v":4000},{"$f":"R12","v":0},658,{"$f":"T12","v":2250},0,{"$f":"V12","v":0},{"$f":"W12","v":0},{"$f":"X12","v":0},0,null,9758,60741,null,null,8]
[null,8,"2022-08-01",{"$f":"D13","v":49300},0,0,0,16762,4437,0,0,0,0,70499,2850,0,4000,0,658,2250,0,0,0,0,0,null,9758,60741,null,null,9]
[null,9,"2022-09-01",49300,0,0,0,16762,4437,0,0,0,0,70499,2850,0,4000,0,658,2250,0,0,0,0,0,null,9758,60741,null,null,10]
{"$rows_left_out":21}
{"sheet":"Other Deduction","index":2,"n_rows":23,"n_cols":122,"rows_kept":23,"merged":[[0,0,0,5],[1,0,1,5],[2,0,2,5],[9,5,11,5],[14,5,16,5],[17,5,18,5],[20,0,20,1],[21,0,21,1],[22,0,22,5]]}
[]
["वेतन के अतिरिक्त कटौतियाँ, आय/जमा राशि एवं छूट का"]
[{"$f":"'GA-55'!D5& \" ,   \" &'GA-55'!K5&\"                         PAN-  \"&'GA-55'!P5","v":"PARMANAND MEGHWAL ,   SENIOR TEACHER                         PAN-  ASQPM6311G"}]
["1. मकान किराया भत्ता (छूट जो लेनी हैं।)",{"v":51228,"d":"51228.00"},null,"18. बचत खाते की जमा राशि पर प्राप्त ब्याज (80 TTA/80 TTB) हेतु",{"v":0,"d":"0.00"},"BASIC+D.A.",{"$nulls":115},"UPS Kuhada Khurd"]
["2. मनोरंजन भत्ता धारा 16(ii) के अंतर्गत",{"v":0,"d":"0.00"},null,"19. अन्य आय - (एफडी पर ब्याज, अन्य ब्याज या अन्य स्त्रोत से आय आदि का योग)",{"v":0,"d":"0.00"},{"$f":"'GA-55'!N30-'GA-55'!I30","v":844681}]
["3. व्यवसाय कर धारा 16(iii) के अंतर्गत",{"v":0,"d":"0.00"},null,"20. अन्य जमा राशि (धारा 80C के अंतर्गत)",{"v":0,"d":"0.00"},"Taxable Amt"]
["4. गृह संपत्ति से प्राप्त किराया - आय",{"v":0,"d":"0.00"},null,"21. धारा 80CCC -पेंशन प्लान हेतु अंशदान (एनपीएस के अलावा)",{"v":0,"d":"0.00"},{"$f":"'Tax Old Regime'!Q48","v":675070}]
["5. गृहकर",{"v":0,"d":"0.00"},null,"22. 80CCD(1B) - नवीन पेंशन योजना में अतिरिक्त अंशदान (अधिकतम रु. 50,000)",{"v":0,"d":"0.00"},"Tax Deposited"]
["6. गृह ऋण किस्त मूल (जो वेतन से नहीं काटा गया)",{"v":0,"d":"0.00"},null,"23. धारा 80D - चिकित्सा बीमा प्रीमियम (सामान्य-25,000 व वरिष्ठ नागरिक 50,000)",{"v":0,"d":"0.00"},{"$f":"'GA-55'!X30","v":{"v":0,"d":"0.00"}}]
["7. गृह ऋण किस्त ब्याज (जो वेतन से नहीं काटा गया)",{"v":0,"d":"0.00"},null,"24. धारा 80DD विकलांग आश्रितों के चिकित्सा उपचार (अधिकतम: 75,000 व वरिष्ठ नागरिक 125,000)",{"v":0,"d":"0.00"},"Rebate Under Section\n80C, 80CCC, 80CCD(1)"]
["8. जीवन बीमा प्रीमियम जो  (जो वेतन से नहीं काटा गया) LIC",{"v":0,"d":"0.00"},null,"25. धारा 80DDB - विशिष्ट रोगों के उपचार हेतु (सामान्य 40,000 , वरिष्ठ नागरिक 1 लाख)",{"v":0,"d":"0.00"},{"$nulls":116},"UPS Banediya Charnan"]
["9. पी.एल.आई. (PLI)",{"v":0,"d":"0.00"},null,"26. धारा 80E उच्च शिक्षा हेतु लिए ऋण का ब्याज (धारा 10E)",{"v":0,"d":"0.00"},{"$nulls":116},"UPS Laxmipura Dhakaran"]
["10. ट्यूशन फीस (Tution Fees)",{"v":0,"d":"0.00"},null,"27. धारा 80G धर्मार्थ संस्थाओं आदि को दिये दान (क श्रेणी में 100 प्रतिशत एवं ख श्रेणी में 50 प्रतिशत)",{"v":0,"d":"0.00"},{"$f":"'Tax Old Regime'!Q32","v":121121},{"$nulls":115},"UPS Pathraj Kala"]
["11. यू.एल.आई.पी./वार्षिक प्लान",{"v":0,"d":"0.00"},null,"28. धारा 80U स्थाई रूप से शारीरिक असमर्थता की दशा में (अधिकतम 75,000 तथा अधिनियम 1995 के अनुसार 125,000)",{"v":0,"d":"0.00"}]
["12. राष्ट्रीय बचत पत्र (NSC)",{"v":0,"d":"0.00"},null,"29. धारा  80GGA अनुमोदित वैज्ञानिक, सामाजिक, ग्रामीण विकास आदि हेतु दिया गया दान",{"v":0,"d":"0.00"},"मकान किराया छूट के रशीद की आवश्यकता",{"$nulls":115},"PS Aarampura"]
{"$rows_left_out":9}
{"sheet":"Tax Old Regime","index":3,"n_rows":66,"n_cols":17,"rows_kept":66,"merged":[[0,1,0,16],[1,1,1,16],[2,1,2,16],[3,2,3,3],[3,4,3,9],[3,11,3,13],[3,15,3,16],[4,2,4,14],[5,2,5,14],[6,2,6,14],[7,2,7,14],[8,1,10,1],[8,2,8,11],[8,12,8,14],[8,15,9,16],[9,2,9,11],[9,12,9,14],[10,2,10,11],[10,12,10,14],[11,2,11,14],[12,1,14,1],[12,2,12,9],[12,10,12,11],[12,12,12,14],[12,15,14,16],[13,2,14,3],[13,4,13,6],[13,7,13,9],[13,10,13,11],[13,12,13,14],[14,4,14,6],[14,7,14,9],[14,10,14,11],[14,12,14,14],[15,2,15,14],[16,2,16,14],[17,2,17,14],[18,2,18,14],[19,1,33,1],[19,2,19,16],[20,2,20,16],[21,3,21,6],[21,10,21,12],[21,15,30,16],[22,3,22,6],[22,10,22,12],[23,3,23,6],[23,10,23,12],[24,3,24,6],[24,10,24,12],[25,3,25,6],[25,10,25,12],[26,3,26,6],[26,10,26,12],[27,3,27,6],[27,10,27,12],[28,3,28,6],[28,10,28,12],[29,3,29,6],[29,10,29,12],[30,2,30,12],[31,2,31,14],[32,2,32,14],[33,2,33,14],[34,1,44,1],[34,2,34,16],[35,2,35,14],[36,2,36,14],[37,2,37,14],[38,2,38,14],[39,2,39,14],[40,2,40,14],[41,2,41,14],[42,2,42,14],[43,2,43,14],[44,2,44,14],[45,2,45,14],[46,2,46,14],[47,2,47,14],[48,1,58,1],[48,2,48,16],[49,2,49,6],[49,7,49,10],[49,11,49,14],[50,2,50,4],[50,5,50,6],[50,7,50,9],[50,11,50,13],[51,2,51,4],[51,5,51,6],[51,7,51,9],[51,11,51,13],[52,2,52,4],[52,5,52,6],[52,7,52,9],[52,11,52,13],[53,2,53,4],[53,5,53,6],[53,7,53,9],[53,11,53,13],[54,2,54,14],[55,2,55,14],[56,2,56,14],[57,2,57,14],[58,2,58,14],[59,2,59,14],[60,2,60,14],[61,1,62,1],[61,2,62,4],[61,5,61,8],[61,9,61,10],[61,12,61,13],[61,15,61,16],[62,5,62,8],[62,9,62,10],[62,12,62,13],[62,15,62,16],[63,1,63,14],[65,3,65,4],[65,12,65,15],[67,2,69,16],[70,11,76,16],[75,3,75,9]]}
[]
[null,{"$f":"'GA-55'!C3","v":"GOVT. SR. SECONDARY SCHOOL, GORDHANPURA, ATRU, BARAN"}]
[null,"आयकर गणना प्रपत्र वर्ष 2022-23 (कर निर्धारण वर्ष 2023-24)"]
[null,1,"नाम कर्मचारी :",null,{"$f":"'GA-55'!D5","v":"PARMANAND MEGHWAL"},{"$nulls":5},"पद :",{"$f":"'GA-55'!K5","v":"SENIOR TEACHER"},null,null,"PAN :",{"$f":"IF('GA-55'!P5=\"\",\"\",'GA-55'!P5)","v":"ASQPM6311G"}]
[null,2,"आय: वर्ष-2022-23 में प्राप्त कुल वेतन (कर योग्य सुविधाओं के मूल्य सहित)",{"$nulls":12},"रु.",{"$f":"'GA-55'!N30","v":{"v":897421,"d":"897421.00"}}]
[null,3,"(i) गृह किराया, धारा 10(13-A) के अंतर्गत जो कर मुक्त हैं।",{"$nulls":12},"रु.",{"$f":"'Other Deduction'!B4","v":{"v":51228,"d":"51228.00"}}]
[null,null,"(ii) धारा 10(14) के अंतर्गत अन्य भत्ते ",{"$nulls":12},"रु.",{"$f":"'Other Deduction'!B20","v":{"v":0,"d":"0.00"}}]
[null,4,"                                                शेष (2-3)",{"$nulls":12},"रु.",{"$f":"Q5-Q6-Q7","v":{"v":846193,"d":"846193.00"}}]
[null,5,"(i) मनोरंजन भत्ता धारा 16(ii) के अंतर्गत (अधिकतम सीमा रु. 5000)",{"$nulls":9},{"$f":"'Other Deduction'!B5","v":{"v":0,"d":"0.00"}}]
[null,null,"(ii) व्यवसाय कर धारा 16(iii) के अंतर्गत",{"$nulls":9},{"$f":"'Other Deduction'!B6","v":{"v":0,"d":"0.00"}}]
[null,null,"(iii) स्टेंडर्ड डिडक्शन (Standard Deduction) 50,000 (अधिकतम)",{"$nulls":9},{"$f":"IF(Q8<50000,Q8,50000)","v":{"v":50000,"d":"50000.00"}},null,null,"रु.",{"$f":"SUM(M9:O11)","v":{"v":50000,"d":"50000.00"}}]
[null,6,"                                                                                             शेष (4-5)",{"$nulls":12},"रु.",{"$f":"Q8-Q11","v":{"v":796193,"d":"796193.00"}}]
[null,7,"(अ) गृह संपत्ति से आय (1)स्वयं के उपयोग में शून्य",{"$nulls":7},"(2) प्राप्त किराया रु.",null,{"$f":"'Other Deduction'!B7","v":{"v":0,"d":"0.00"}}]
[null,null,"(ब) घटाये",null,"किराए का 30%",null,null,"गृह ऋण पर ब्याज",null,null,"गृहकर",null,"योग 7(ब)"]
[{"$nulls":4},{"$f":"ROUND(M13*0.3,0)","v":{"v":0,"d":"0.00"}},null,null,{"$f":"IF(('GA-55'!W30+'Other Deduction'!B10)>200000,200000,('GA-55'!W30+'Other Deduction'!B10))","v":{"v":0,"d":"0.00"}},null,null,{"$f":"'Other Deduction'!B8","v":{"v":0,"d":"0.00"}},null,{"$f":"E15+H15+K15","v":{"v":0,"d":"0.00"}}]
{"$rows_left_out":52}
{"sheet":"Tax New Regime","index":4,"n_rows":69,"n_cols":17,"rows_kept":69,"merged":[[0,1,0,16],[1,1,1,16],[2,1,2,16],[3,2,3,3],[3,4,3,9],[3,11,3,13],[3,15,3,16],[4,2,4,14],[5,2,5,14],[6,2,6,14],[7,2,7,14],[8,1,10,1],[8,2,8,11],[8,12,8,14],[8,15,9,16],[9,2,9,11],[9,12,9,14],[10,2,10,11],[10,12,10,14],[11,2,11,14],[12,1,14,1],[12,2,12,9],[12,10,12,11],[12,12,12,14],[12,15,14,16],[13,2,14,3],[13,4,13,6],[13,7,13,9],[13,10,13,11],[13,12,13,14],[14,4,14,6],[14,7,14,9],[14,10,14,11],[14,12,14,14],[15,2,15,14],[16,2,16,14],[17,2,17,14],[18,2,18,14],[19,1,33,1],[19,2,19,16],[20,2,20,16],[21,3,21,6],[21,10,21,12],[21,15,30,16],[22,3,22,6],[22,10,22,12],[23,3,23,6],[23,10,23,12],[24,3,24,6],[24,10,24,12],[25,3,25,6],[25,10,25,12],[26,3,26,6],[26,10,26,12],[27,3,27,6],[27,10,27,12],[28,3,28,6],[28,10,28,12],[29,3,29,6],[29,10,29,12],[30,2,30,12],[31,2,31,14],[32,2,32,14],[33,2,33,14],[34,1,44,1],[34,2,34,16],[35,2,35,14],[36,2,36,14],[37,2,37,14],[38,2,38,14],[39,2,39,14],[40,2,40,14],[41,2,41,14],[42,2,42,14],[43,2,43,14],[44,2,44,14],[45,2,45,14],[46,2,46,14],[47,2,47,14],[48,1,61,1],[48,2,48,16],[49,2,49,6],[49,7,49,10],[49,11,49,14],[50,2,50,4],[50,5,50,6],[50,7,50,9],[50,11,50,13],[51,2,51,4],[51,5,51,6],[51,7,51,9],[51,11,51,13],[52,2,52,4],[52,5,52,6],[52,7,52,9],[52,11,52,13],[53,2,53,4],[53,5,53,6],[53,7,53,9],[53,11,53,13],[54,2,54,4],[54,5,54,6],[54,7,54,9],[54,11,54,13],[55,2,55,4],[55,5,55,6],[55,7,55,9],[55,11,55,13],[56,2,56,4],[56,5,56,6],[56,7,56,9],[56,11,56,13],[57,2,57,14],[58,2,58,14],[59,2,59,14],[60,2,60,14],[61,2,61,14],[62,2,62,14],[63,2,63,14],[64,1,65,1],[64,2,65,4],[64,5,64,8],[64,9,64,10],[64,12,64,13],[64,15,64,16],[65,5,65,8],[65,9,65,10],[65,12,65,13],[65,15,65,16],[66,1,66,14],[68,3,68,5],[70,2,72,16],[73,11,79,16],[78,3,78,9]]}
[]
[null,{"$f":"'GA-55'!C3","v":"GOVT. SR. SECONDARY SCHOOL, GORDHANPURA, ATRU, BARAN"}]
[null,"आयकर गणना प्रपत्र वर्ष 2022-23 (कर निर्धारण वर्ष 2023-24)"]
[null,1,"नाम कर्मचारी :",null,{"$f":"'GA-55'!D5","v":"PARMANAND MEGHWAL"},{"$nulls":5},"पद :",{"$f":"'GA-55'!K5","v":"SENIOR TEACHER"},null,null,"PAN :",{"$f":"IF('GA-55'!P5=\"\",\"\",'GA-55'!P5)","v":"ASQPM6311G"}]
[null,2,"आय: वर्ष-2022-23 में प्राप्त कुल वेतन (कर योग्य सुविधाओं के मूल्य सहित)",{"$nulls":12},"रु.",{"$f":"'GA-55'!N30","v":{"v":897421,"d":"897421.00"}}]
[null,3,"(i) गृह किराया, धारा 10(13-A) के अंतर्गत जो कर मुक्त हैं।",{"$nulls":12},"रु.",{"v":0,"d":"0.00"}]
[null,null,"(ii) धारा 10(14) के अंतर्गत अन्य भत्ते ",{"$nulls":12},"रु.",{"v":0,"d":"0.00"}]
[null,4,"                                                                                                       शेष (2-3)",{"$nulls":12},"रु.",{"$f":"Q5-Q6-Q7","v":{"v":897421,"d":"897421.00"}}]
[null,5,"(i) मनोरंजन भत्ता धारा 16(ii) के अंतर्गत (अधिकतम सीमा रु. 5000)",{"$nulls":9},{"$f":"'Other Deduction'!B5","v":{"v":0,"d":"0.00"}}]
[null,null,"(ii) व्यवसाय कर धारा 16(iii) के अंतर्गत",{"$nulls":9},{"$f":"'Other Deduction'!B6","v":{"v":0,"d":"0.00"}}]
[null,null,"(iii) स्टेंडर्ड डिडक्शन (Standard Deduction) 50,000 (अधिकतम)",{"$nulls":9},{"v":0,"d":"0.00"},null,null,"रु.",{"$f":"SUM(M9:O11)","v":{"v":0,"d":"0.00"}}]
[null,6,"                                                                                                     शेष (4-5)",{"$nulls":12},"रु.",{"$f":"Q8-Q11","v":{"v":897421,"d":"897421.00"}}]
[null,7,"(अ) गृह संपत्ति से आय (1)स्वयं के उपयोग में शून्य",{"$nulls":7},"(2) प्राप्त किराया रु.",null,{"v":0,"d":"0.00"}]
[null,null,"(ब) घटाये",null,"किराए का 30%",null,null,"गृह ऋण पर ब्याज",null,null,"गृहकर",null,"योग 7(ब)"]
[{"$nulls":4},{"$f":"ROUND(M13*0.3,0)","v":{"v":0,"d":"0.00"}},null,null,{"v":0,"d":"0.00"},null,null,{"$f":"'Other Deduction'!B8","v":{"v":0,"d":"0.00"}},null,{"$f":"E15+H15+K15","v":{"v":0,"d":"0.00"}}]
{"$rows_left_out":55}
{"sheet":"Form 16","index":5,"n_rows":157,"n_cols":12,"rows_kept":157,"merged":[[0,0,0,11],[1,0,1,11],[1,12,157,12],[2,0,2,11],[3,0,3,11],[4,0,4,11],[5,0,5,11],[6,0,6,5],[6,6,6,11],[7,0,7,5],[7,6,7,11],[8,0,8,5],[8,6,8,11],[9,0,10,5],[9,6,10,11],[11,0,11,2],[11,3,11,5],[11,6,11,11],[12,0,12,2],[12,3,12,5],[12,6,12,11],[13,3,15,5],[13,6,13,8],[13,9,13,11],[14,6,14,7],[14,9,15,11],[15,6,15,7],[17,0,17,1],[17,2,17,4],[17,5,17,6],[17,7,17,9],[17,10,17,11],[18,0,18,1],[18,2,18,4],[18,5,18,6],[18,7,18,9],[18,10,18,11],[19,0,19,1],[19,2,19,4],[19,5,19,6],[19,7,19,9],[19,10,19,11],[20,0,20,1],[20,2,20,4],[20,5,20,6],[20,7,20,9],[20,10,20,11],[21,0,21,1],[21,2,21,4],[21,5,21,6],[21,7,21,9],[21,10,21,11],[22,0,22,1],[22,2,22,4],[22,5,22,6],[22,7,22,9],[22,10,22,11],[23,0,23,11],[24,1,24,3],[24,4,24,11],[25,1,25,3],[25,4,25,5],[25,6,25,7],[25,8,25,9],[25,10,25,11],[26,4,26,5],[26,6,26,7],[26,8,26,9],[26,10,26,11],[27,1,27,3],[27,6,27,7],[27,8,27,9],[28,1,28,3],[28,4,28,5],[28,6,28,7],[28,8,28,9],[29,1,29,3],[29,4,29,5],[29,6,29,7],[29,8,29,9],[30,1,30,3],[31,1,31,3],[32,1,32,3],[33,1,33,3],[34,1,34,3],[35,1,35,3],[36,1,36,3],[36,4,36,5],[36,6,36,7],[36,8,36,9],[37,1,37,3],[37,4,37,5],[37,6,37,7],[37,8,37,9],[38,1,38,3],[38,4,38,5],[38,6,38,7],[38,8,38,9],[39,1,39,3],[39,4,39,5],[39,6,39,7],[39,8,39,9],[40,1,40,3],[41,1,41,3],[41,4,41,5],[41,6,41,7],[41,8,41,9],[43,0,43,11],[44,1,44,3],[44,4,44,11],[45,1,45,3],[45,4,45,5],[45,6,45,7],[45,8,45,9],[45,10,45,11],[46,4,46,5],[46,6,46,7],[46,8,46,9],[46,10,46,11],[47,1,47,3],[47,6,47,7],[47,8,47,9],[48,1,48,3],[48,6,48,7],[48,8,48,9],[49,1,49,3],[49,6,49,7],[49,8,49,9],[50,1,50,3],[50,6,50,7],[50,8,50,9],[51,1,51,3],[51,6,51,7],[51,8,51,9],[52,1,52,3],[52,6,52,7],[52,8,52,9],[53,1,53,3],[53,6,53,7],[53,8,53,9],[54,1,54,3],[54,6,54,7],[54,8,54,9],[55,1,55,3],[55,6,55,7],[55,8,55,9],[56,1,56,3],[56,6,56,7],[56,8,56,9],[57,1,57,3],[57,6,57,7],[57,8,57,9],[58,1,58,3],[58,6,58,7],[58,8,58,9],[59,1,59,3],[59,6,59,7],[59,8,59,9],[60,1,60,3],[61,1,61,3],[61,4,61,5],[61,6,61,11],[62,0,62,11],[63,1,63,3],[63,6,63,8],[64,0,64,2],[64,9,64,10],[65,0,65,4],[66,0,67,11],[68,0,68,1],[69,0,69,11],[70,0,70,11],[71,0,71,11],[72,0,72,11],[73,0,73,6],[74,0,74,11],[75,0,75,11],[76,0,76,11],[77,0,77,11],[78,0,78,11],[79,0,79,4],[82,0,82,11],[83,0,83,11],[90,9,90,10],[93,0,93,6],[94,0,94,6],[95,9,95,10],[109,6,111,7],[109,8,111,9],[109,10,111,11],[110,0,110,3],[112,6,112,7],[112,8,112,9],[112,10,112,11],[113,2,113,4],[113,6,113,7],[113,8,113,9],[113,10,113,11],[114,2,114,4],[114,6,114,7],[114,8,114,9],[114,10,114,11],[115,2,115,4],[115,6,115,7],[115,8,115,9],[115,10,115,11],[116,2,116,4],[116,6,116,7],[116,8,116,9],[116,10,116,11],[117,6,117,7],[117,8,117,9],[117,10,117,11],[118,2,118,4],[118,6,118,7],[118,8,118,9],[118,10,118,11],[119,6,119,7],[119,8,119,9],[119,10,119,11],[120,6,120,7],[120,8,120,9],[120,10,120,11],[121,6,121,7],[121,8,121,9],[121,10,121,11],[124,6,124,7],[124,8,124,9],[124,10,124,11],[125,6,125,7],[125,8,125,9],[125,10,125,11],[128,8,128,9],[128,10,128,11],[129,2,129,4],[129,6,129,7],[129,8,129,9],[129,10,129,11],[130,2,130,4],[130,6,130,7],[130,8,130,9],[130,10,130,11],[131,2,131,4],[131,6,131,7],[131,8,131,9],[131,10,131,11],[132,6,132,7],[132,8,132,9],[132,10,132,11],[133,10,133,11],[134,10,134,11],[136,10,136,11],[137,10,137,11],[138,10,138,11],[139,10,139,11],[140,10,140,11],[141,10,141,11],[142,10,142,11],[143,10,143,11],[144,10,144,11],[145,0,145,11],[146,1,146,3],[146,6,146,8],[147,0,147,2],[148,0,148,11],[153,5,153,11],[154,5,154,11],[155,0,155,2],[155,7,155,11],[156,0,156,2],[156,7,156,11],[157,5,157,11]]}
[]
["FORM NO.16"]
["[See rule 31 (1) (a)]"]
["Part A"]
["Certificate under section 203 of the Income Tax Act, 1961 for tax deducted"]
["at source from income chargeable under the head  “ Salaries “"]
["Name and address of the employer",{"$nulls":5},"Name and Designation of the employee"]
[{"$f":"'Master Sheet'!M9","v":"RAM DAYAL NAGAR"},{"$nulls":5},{"$f":"'GA-55'!D5","v":"PARMANAND MEGHWAL"}]
[{"$f":"'Master Sheet'!M7","v":"PRINCIPAL"},{"$nulls":5},{"$f":"'GA-55'!K5","v":"SENIOR TEACHER"}]
[{"$f":"'GA-55'!C3","v":"GOVT. SR. SECONDARY SCHOOL, GORDHANPURA, ATRU, BARAN"},{"$nulls":5},{"$f":"'GA-55'!C3","v":"GOVT. SR. SECONDARY SCHOOL, GORDHANPURA, ATRU, BARAN"}]
[]
["PAN of the Deducter",null,null,"TAN of the Deducter",null,null,"PAN of the Employee"]
[{"$nulls":3},{"$f":"'GA-55'!U5","v":"JDHG09699E"},null,null,{"$f":"'GA-55'!P5","v":"ASQPM6311G"}]
["TDS Circle where annual",{"$nulls":5},"PERIOD",null,null,"Assessment Year"]
["return / statement under",{"$nulls":5},"FROM",null,"TO","2023-24"]
{"$rows_left_out":143}
{"sheet":"Hra Receipt","index":6,"n_rows":18,"n_cols":9,"rows_kept":18,"merged":[[0,0,0,9],[1,0,1,9],[2,0,3,9],[5,2,5,9],[6,2,6,4],[6,5,6,7],[7,2,7,9],[8,4,8,9],[9,1,9,3],[9,5,9,9],[10,1,10,2],[10,3,10,5],[12,2,12,3],[13,2,13,3],[14,6,14,9],[15,6,15,9],[16,6,16,9],[17,6,17,9],[18,0,18,9]]}
[]
["RECEIPT OF HOUSE RENT"]
["(Under section 1 (13-A) of Income Tax Act)"]
[]
[{"$nulls":7},"Date:-",{"$f":"TODAY()","v":"2022-12-26"}]
[null,"I Owner ",{"$f":"'Master Sheet'!M9","v":"RAM DAYAL NAGAR"}]
[null,null,"Received with Thanks from Sri/Smt. ",null,null,{"$f":"'Master Sheet'!E5","v":"PARMANAND MEGHWAL"},null,null,{"$f":"'Master Sheet'!E6","v":"SENIOR TEACHER"}]
[null,"Address-",{"$f":"'Master Sheet'!D2","v":"GOVT. SR. SECONDARY SCHOOL, GORDHANPURA, ATRU, BARAN"}]
[null,"The sum of ","Rs.=",{"$f":"'Other Deduction'!F18","v":{"v":135696.1,"d":"135696.10"}},{"$f":"PROPER(SpellNumber(D9))","v":"One Hundred Thirty-Five Thousand Six Hundred Ninety-Six"}]
[null,"Towards the House Rent @  Rs. =",null,null,{"$f":"ROUND(D9/12,0)","v":11308},{"$f":"PROPER(SpellNumber(E10))","v":"Eleven Thousand Three Hundred Eight"}]
[null,"Per Month From :-",null,"April 2022 To March 2023"]
[]
[null,"Rs.  =  ",{"$f":"D9","v":135696.1}]
[null,"Date:-",{"$f":"TODAY()","v":"2022-12-26"}]
[{"$nulls":6},"(Signature of House Owner)"]
{"$rows_left_out":3}