{"text_format":"3","workbook":"xlsx","n_sheets":7,"sheets":["Basic Profile","GA-55","Other Deduction","Tax Old Regime","Tax New Regime","Form 16","HRA Receipt"],"not_rendered":{"macros":1,"defined_names":341},"read":"whole","date_system":"1900"}

{"sheet":"Basic Profile","index":0,"n_rows":109,"n_cols":22,"rows_kept":109,"merged":[[0,0,0,17],[1,0,1,17],[2,0,2,9],[2,10,2,13],[2,14,2,17],[3,0,3,9],[3,10,3,13],[3,14,3,17],[4,0,4,9],[4,10,4,13],[4,14,4,17],[5,0,5,1],[5,2,5,13],[5,14,5,15],[5,16,5,17],[6,0,8,0],[6,1,6,6],[6,7,6,17],[7,1,8,1],[7,2,8,2],[7,3,8,3],[7,4,8,4],[7,5,8,5],[7,6,8,6],[7,7,8,7],[7,8,8,8],[7,9,7,10],[7,11,8,11],[7,12,8,12],[7,13,8,13],[7,14,8,14],[7,15,8,15],[7,16,8,16],[7,17,8,17]]}
["INCOME TAX CALCULATOR 2021-22"]
["vk;dj x.kuk izi= 2021&22"]
["1- bl 'khV dks mi;ksx djus ds fy, KRUTIDEV-10 o DEVLYS-10 dks dEI;wVj esa INSTALL djsaA",{"$nulls":9},"DDO NAME",{"$nulls":3},"HANUMAN SAHAY"]
["2- GA-55 'khV dks t#j psd djsaa] vk;dj] thou chek] vkfn dh jkf'k esa ;fn fdlh ekg esa vUrj gksus ijA",{"$nulls":9},"DDO FATHER NAME",{"$nulls":3},"GULLA RAM"]
[{"$nulls":10},"DDO DESIGNATION",{"$nulls":3},"PRINCIPAL"]
["OFFICE NAME",null,"GOVT. SR. SECONDARY SCHOOL, DILOD HATHI, ATRU BARAN",{"$nulls":11},"TAN NUMBER",null,"XXXX9987D"]
["S.N.","EMPLOYEE BASIC DETAIL'S",{"$nulls":5},"PAYMENT DETAIL'S"]
[null,"Employee Name","Designation","Pan Number","GPF/NPS","Bank Ac/No.","Mobile Number","MARCH BASIC","HRA","SURRENDER 2020-21",null,"BONUS","jkT; chek   S.I.","thou chek   L.I.C.","nq?kZVuk chek  GIS","fgrdkjh fu/kh","ITAX","RGHS",null,"GPF","Yes",{"v":0.08,"d":"8%"}]
[{"$nulls":9},"YES/NO","MONTH",{"$nulls":8},"NPS","No",{"v":0.16,"d":"16%"}]
[1,"PARMANAND MEGHWAL","SR. TEACHER","ASQPM6311H","NPS",2225617763,9784379510,45100,{"v":0.08,"d":"8%"},"Yes",5,"Yes",3000,0,220,250,0,0]
[2,"HANUMAN SAHAY","PRICIPAL","AASDF6677K","NPS",123456789,9786534334,67200,{"v":0.08,"d":"8%"},"No",5,"No",5000,5641,700,500,3000,440,null,"Yes",1]
[3,{"$nulls":18},"No",2]
[4,{"$nulls":19},3]
[5,{"$nulls":19},4]
[6,{"$nulls":19},5]
{"$rows_left_out":95}
{"sheet":"GA-55","index":1,"n_rows":37,"n_cols":29,"rows_kept":37,"merged":[[0,2,4,2],[1,3,1,22],[1,25,1,26],[2,3,2,10],[2,11,2,12],[2,13,2,22],[2,23,2,24],[3,3,3,12],[3,15,3,16],[3,17,3,22],[3,25,3,26],[4,3,4,28],[5,3,5,28],[6,3,6,28],[7,2,8,2],[7,3,8,7],[7,8,7,10],[7,11,7,14],[7,15,7,16],[7,17,7,19],[7,20,7,21],[7,22,7,24],[7,25,7,26],[7,27,7,28],[8,8,8,24],[8,25,8,26],[8,27,8,28],[38,2,38,28]]}
[null,null,"USE KRUTIDEV &             DEVLYS 10 FONT"]
[{"$nulls":3},";fn vki 01-01-2004 dks ;k mlds i'pkr fu;qDr dkfeZd gSa rks Drop Down Menu esa ls \"Yes\" pqusa] vU;Fkk \"No\" pqusaA ",{"$nulls":21},{"$f":"VLOOKUP(C7,'Basic Profile'!A10:R109,5,0)","v":"NPS"},null,null,"HRA"]
[{"$nulls":3},"D;k vkius lefiZr osru fy;k gS \\",{"$nulls":7},{"$f":"VLOOKUP(C7,'Basic Profile'!A10:R109,10,0)","v":"Yes"},null,";fn gk¡ rks ftl ekg esa fcy cuk mldk Øekad pqusaA",{"$nulls":9},{"$f":"VLOOKUP(C7,'Basic Profile'!A10:R109,11,0)","v":5}]
[{"$nulls":3},"D;k vki ofj\"B ukxfjd Js.kh ¼60-80 vk;qoxZ½ esa vkrs gS \\",{"$nulls":11},"No",null,"D;k vkius cksul feyk gS \\",{"$nulls":7},{"$f":"VLOOKUP(C7,'Basic Profile'!A10:R109,12,0)","v":"Yes"},null,null,{"$f":"VLOOKUP(C7,'Basic Profile'!A10:R109,9,0)","v":{"v":0.08,"d":"8%"}}]
[]
[null,null,"S.N.",{"$f":"'Basic Profile'!C6","v":"GOVT. SR. SECONDARY SCHOOL, DILOD HATHI, ATRU BARAN"}]
[null,null,1,"INCOME TAX CALCULATION (GA-55) 2021-22"]
[null,null,"NAME :",{"$f":"VLOOKUP(C7,'Basic Profile'!A10:R109,2,0)","v":"PARMANAND MEGHWAL"},{"$nulls":4},"DESIGNATION",null,null,{"$f":"VLOOKUP(C7,'Basic Profile'!A10:R109,3,0)","v":"SR. TEACHER"},{"$nulls":3},"PAN N0.",null,{"$f":"VLOOKUP(C7,'Basic Profile'!A10:R109,4,0)","v":"ASQPM6311H"},null,null,"TAN NO.",null,{"$f":"'Basic Profile'!Q6","v":"XXXX9987D"},null,null,"A/C NO.",null,{"$f":"VLOOKUP(C7,'Basic Profile'!A10:R109,6,0)","v":2225617763}]
[{"$nulls":8},"RAJTEACHERS.NET",{"$nulls":16},"MOB NO.",null,{"$f":"VLOOKUP(C7,'Basic Profile'!A10:R109,7,0)","v":9784379510}]
[null,null,"Month","Basic Pay","Dearness Pay","Leave  Pay","Spl. Pay","D.A.","H.R.A.","Washing Allow.","ROP (If any, put the value in minus)","Other Allowance 1","Other Allowance 2","Gross  Salary",{"$f":"IF(Z2=\"GPF\",\"GPF\",\"Emp. C.Pen.F.\")","v":"Emp. C.Pen.F."},{"$f":"IF(Z2=\"No\",\"GPF LOAN\",\"\")","v":""},"SI","SI LOAN + INT","RPMF/RGHS","LIC","Group Insurance  \nAccidental","HBA Premium","HBA Interest","Income Tax / TDS","GPF 2004","HITKARI NIDHI","Total\nDeduction","Net Payment","Bill No. & T.V. No."]
[null,3,"2021-03-01",{"$f":"VLOOKUP(C7,'Basic Profile'!A10:R109,8,0)","v":45100},0,0,0,{"$f":"ROUND(17%*D11,0)","v":7667},{"$f":"IF($AC$4=16%,ROUND(0.16*D11,0),ROUND(0.08*D11,0))","v":3608},0,0,0,0,{"$f":"SUM(D11:M11)","v":56375},{"$f":"IF($Z$2=\"NPS\",ROUND((D11+H11)*0.1,0),IF($Z$2=\"GPF\",IF(D11<23101,1450,IF(D11<28501,1625,IF(D11<38501,2100,IF(D11<51501,2850,IF(D11<62001,3575,IF(D11<72001,4200,IF(D11<80001,4800,IF(D11<116001,6150,IF(D11<167001,8900,10500))))))))),0))","v":5277},0,{"$f":"VLOOKUP(C7,'Basic Profile'!A10:R109,13,0)","v":3000},0,{"$f":"IF($Z$2=\"gpf\",IF(D11<18001,265,IF(D11<33501,440,IF(D11<54001,658,875))),0)","v":0},{"$f":"VLOOKUP(C7,'Basic Profile'!A10:R109,14,0)","v":0},0,null,null,{"$f":"VLOOKUP(C7,'Basic Profile'!A10:R109,17,0)","v":0},null,null,{"$f":"SUM(O11:Z11)","v":{"v":8277,"d":"8277.00"}},{"$f":"N11-AA11","v":{"v":48098,"d":"48098.00"}}]
[null,4,"2021-04-01",{"$f":"D11","v":45100},{"$f":"IF(E$11=0,0,ROUND(D12/2,0))","v":0},{"$f":"IF(F$11=0,0,F11)","v":0},0,{"$f":"ROUND(17%*D12,0)","v":7667},{"$f":"IF($AC$4=16%,ROUND(0.16*D12,0),ROUND(0.08*D12,0))","v":3608},{"$f":"IF(J$11=0,0,J11)","v":0},{"$f":"IF(K$11=0,0,K11)","v":0},0,{"$f":"IF(M$11=0,0,M11)","v":0},{"$f":"SUM(D12:M12)","v":56375},{"$f":"IF($Z$2=\"NPS\",ROUND((D12+H12)*0.1,0),IF($Z$2=\"GPF\",IF(D12<23101,1450,IF(D12<28501,1625,IF(D12<38501,2100,IF(D12<51501,2850,IF(D12<62001,3575,IF(D12<72001,4200,IF(D12<80001,4800,IF(D12<116001,6150,IF(D12<167001,8900,10500))))))))),0))","v":5277},{"$f":"P11","v":0},{"$f":"Q11","v":3000},{"$f":"R11","v":0},{"$f":"IF($Z$2=\"gpf\",IF(D12<18001,265,IF(D12<33501,440,IF(D12<54001,658,875))),0)","v":0},{"$f":"T11","v":0},{"$f":"VLOOKUP(C7,'Basic Profile'!A10:R109,15,0)","v":{"v":220,"d":"220.00"}},{"$f":"V11","v":0},0,{"$f":"X11","v":0},0,null,{"v":8497,"d":"8497.00"},{"v":47878,"d":"47878.00"}]
[null,5,"2021-05-01",45100,{"$f":"IF($E$11=0,0,ROUND(D13/2,0))","v":0},0,0,7667,3608,null,{"$f":"IF(K$11=0,0,K12)","v":0},{"$f":"IF(L$11=0,0,L12)","v":0},0,56375,5277,{"$f":"P12","v":0},{"$f":"Q12","v":3000},{"$f":"R12","v":0},0,{"$f":"T12","v":0},0,0,0,0,{"$f":"Y12","v":0},null,{"v":8277,"d":"8277.00"},{"v":48098,"d":"48098.00"}]
[null,6,"2021-06-01",45100,0,0,0,7667,3608,0,0,0,0,56375,5277,0,3000,0,0,0,0,0,0,0,{"$f":"Y13","v":0},null,{"v":8277,"d":"8277.00"},{"v":48098,"d":"48098.00"}]
[null,7,"2021-07-01",{"$f":"MROUND(ROUND(1.03*D14,0),100)","v":46500},0,{"$f":"IF(F$11=0,0,F14)","v":0},{"$f":"IF(G$11=0,0,G14)","v":0},{"$f":"ROUND(28%*D15,0)","v":13020},3720,{"$f":"IF(J$11=0,0,J14)","v":0},{"$f":"IF(K$11=0,0,K14)","v":0},{"$f":"IF(L$11=0,0,L14)","v":0},{"$f":"IF(M$11=0,0,M14)","v":0},63240,5952,{"$f":"P14","v":0},{"$f":"Q14","v":3000},{"$f":"R14","v":0},{"$f":"IF($Z$2=\"gpf\",IF(D15<18001,265,IF(D15<33501,440,IF(D15<54001,658,875))),VLOOKUP(C7,'Basic Profile'!A10:R109,18,0))","v":0},{"$f":"T14","v":0},0,{"$f":"V14","v":0},{"$f":"W14","v":0},{"$f":"X14","v":0},0,null,{"v":8952,"d":"8952.00"},{"v":54288,"d":"54288.00"}]
{"$rows_left_out":23}
{"sheet":"Other Deduction","index":2,"n_rows":21,"n_cols":122,"rows_kept":21,"merged":[[0,0,0,5],[1,0,1,5],[8,5,10,5],[13,5,15,5],[16,5,17,5],[18,0,18,1],[19,0,19,1],[20,0,20,5]]}
["osru ds vfrfjDr dVkSfr;k¡] vk;@tek jkf'k ,oa NwV dk fooj.k"]
[{"$f":"'GA-55'!D8& \" ,   \" &'GA-55'!K8&\"                         PAN-  \"&'GA-55'!P8","v":"PARMANAND MEGHWAL ,                            PAN-  PAN N0."}]
["1- edku fdjk;k HkRrk ¼ NwV tks ysuh gS½",{"v":0,"d":"0.00"},null,"17- cpr [kkrs dh tek jkf'k ij izkIr C;kt (80 TTA/80 TTB) gsrq",{"v":0,"d":"0.00"},"BASIC+D.A.",{"$nulls":115},"UPS Kuhada Khurd"]
["2- euksjatu Hkrk /kkjk 16 ¼ii½ ds vUrxZr ",{"v":0,"d":"0.00"},null,"18- vU; vk; ¼,Q Mh ij C;kt] vU; C;kt ;k vU; L=ks+= ls vk; vkfn dk ;ksx½",{"v":0,"d":"0.00"},{"$f":"'GA-55'!N32-'GA-55'!I32","v":731546}]
["3- O;o;k; dj /kkjk 16 ¼iii½ ds vUrxrZ ",{"v":0,"d":"0.00"},null,"19- vU; tek jkf'k ¼/kkjk 80 lh ds vUrxZr½",{"v":0,"d":"0.00"},"Taxable Amt"]
["4- x`g lEifr ls izkIr fdjk;k & vk;",{"v":0,"d":"0.00"},null,"20- /kkjk 80CCC - isa'ku Iyku gsrq va'knku ¼,u-ih-,l- ds avykok½",{"v":0,"d":"0.00"},{"$f":"'Tax Old Regime'!Q47","v":616240}]
["5- x`gdj ",{"v":0,"d":"0.00"},null,"21- /kkjk 80CCD(1B) -uohu isa'ku ;kstuk esa vfrfjDr va'knku ¼vf/kdre :- 50]000½",{"v":0,"d":"0.00"},"Tax Deposited"]
["6- x`g _.k fdLr ewy ¼tks osru ls ugha dkVk x;k½",{"v":0,"d":"0.00"},null,"22- /kkjk 80D - fpfdRlk chek izhfe;e ¼lkekU; 25000] ofj\"B ukxfjd 50000½",{"v":0,"d":"0.00"},{"$f":"'GA-55'!X32","v":{"v":0,"d":"0.00"}}]
["7- x`g _.k fdLr C;kt ¼tks osru ls ugha dkVk x;k½",{"v":0,"d":"0.00"},null,"23- /kkjk 80DD - fodykax vkfJrksa ds fpfdRlk mipkj¼vf/kdre 75000] 80% fodykaxrk 125000½",{"v":0,"d":"0.00"},"Rebate Under Section\n80C, 80CCC, 80CCD(1)"]
["8- thou chek izhfe;e ¼tks osru ls ugh dkVk x;k½ LIC",{"v":0,"d":"0.00"},null,"24- /kkjk 80DDB - fof'k\"V jksxksa ds mipkj gsrq dVkSrh ¼lkekU; 40000] ofj\"B ukxfjd 1 yk[k½",{"v":0,"d":"0.00"},{"$nulls":116},"UPS Banediya Charnan"]
["9- ih-,y-vkbZ- (PLI)",{"v":0,"d":"0.00"},null,"25- /kkjk 80E - mPp f'k{kk gsrq fy, _.k dk C;kt ¼/kkjk 80E½",{"v":0,"d":"0.00"},{"$nulls":116},"UPS Laxmipura Dhakaran"]
["10- V;w'ku Qhl (Tution Fees)",{"v":0,"d":"0.00"},null,"26- /kkjk 80G - /kekZFkZ laLFkkvksa vkfn dks fn;s nku ¼d Js.kh 100% ,oa [k Js.kh 50%½",{"v":0,"d":"0.00"},{"$f":"'Tax Old Regime'!Q31","v":113216},{"$nulls":115},"UPS Pathraj Kala"]
["11- ;w- ,y- vkbZ- ih-@okf\"kZd Iyku",{"v":0,"d":"0.00"},null,"27- /kkjk 80U - LFkkbZ 'kkjhfjd fodykaxrk ¼vf/kdre 75000] 80% fodykaxrk 125000½",{"v":0,"d":"0.00"}]
["12- jk\"Vªh; cpr i= (NSC)",{"v":0,"d":"0.00"},null,"28- /kkjk 80 GGA - vuqeksfnr oSKkfud]lkekftd]xzkeh.k fodkl vkfn gsrq fn;k x;k nku",{"v":0,"d":"0.00"},"edku fdjk;k NwV ds fy, jlhn dh vko';drk",{"$nulls":115},"PS Aarampura"]
["13- jk\"Vªh; cpr i= ij vnr C;kt",{"v":0,"d":"0.00"},null,"29- bfDoVh fyad lsfoax Ldhe",{"v":0,"d":"0.00"},{"$nulls":116},"UPS Laxmipura Dhakaran"]
{"$rows_left_out":7}
{"sheet":"Tax Old Regime","index":3,"n_rows":65,"n_cols":17,"rows_kept":65,"merged":[[0,1,0,16],[1,1,1,16],[2,2,2,3],[2,4,2,9],[2,11,2,13],[2,15,2,16],[3,2,3,14],[4,2,4,14],[5,2,5,14],[6,1,8,1],[6,2,6,11],[6,12,6,14],[6,15,7,16],[7,2,7,11],[7,12,7,14],[8,2,8,11],[8,12,8,14],[9,2,9,14],[10,1,12,1],[10,2,10,9],[10,10,10,11],[10,12,10,14],[10,15,12,16],[11,2,12,3],[11,4,11,6],[11,7,11,9],[11,10,11,11],[11,12,11,14],[12,4,12,6],[12,7,12,9],[12,10,12,11],[12,12,12,14],[13,2,13,14],[14,2,14,14],[15,2,15,14],[16,2,16,14],[17,1,33,1],[17,2,17,16],[18,2,18,16],[19,3,19,6],[19,10,19,12],[19,15,29,16],[20,3,20,6],[20,10,20,12],[21,3,21,6],[21,10,21,12],[22,3,22,6],[22,10,22,12],[23,3,23,6],[23,10,23,12],[24,3,24,6],[24,10,24,12],[25,3,25,6],[25,10,25,12],[26,3,26,6],[26,10,26,12],[27,3,27,6],[27,10,27,12],[28,3,28,6],[28,10,28,12],[29,2,29,12],[30,2,30,14],[31,2,31,14],[32,2,32,14],[33,2,33,14],[34,1,43,1],[34,2,34,16],[35,2,35,14],[36,2,36,14],[37,2,37,14],[38,2,38,14],[39,2,39,14],[40,2,40,14],[41,2,41,14],[42,2,42,14],[43,2,43,14],[44,2,44,14],[45,2,45,14],[46,2,46,14],[47,1,57,1],[47,2,47,16],[48,2,48,6],[48,7,48,10],[48,11,48,14],[49,2,49,4],[49,5,49,6],[49,7,49,9],[49,11,49,13],[50,2,50,4],[50,5,50,6],[50,7,50,9],[50,11,50,13],[51,2,51,4],[51,5,51,6],[51,7,51,9],[51,11,51,13],[52,2,52,4],[52,5,52,6],[52,7,52,9],[52,11,52,13],[53,2,53,14],[54,2,54,14],[55,2,55,14],[56,2,56,14],[57,2,57,14],[58,2,58,14],[59,2,59,14],[60,1,61,1],[60,2,61,4],[60,5,60,8],[60,9,60,10],[60,12,60,13],[60,15,60,16],[61,5,61,8],[61,9,61,10],[61,12,61,13],[61,15,61,16],[62,1,62,14],[66,2,68,16],[69,11,75,16],[74,3,74,9]]}
[null,{"$f":"'GA-55'!D6","v":"GOVT. SR. SECONDARY SCHOOL, DILOD HATHI, ATRU BARAN"}]
[null,"vk;dj x.kuk izi= o\"kZ 2021&2022 ¼dj fu/kkZj.k o\"kZ 2022&2023½"]
[null,1,"uke deZpkjh %",null,{"$f":"'GA-55'!D8","v":"PARMANAND MEGHWAL"},{"$nulls":5}," in %",{"$f":"'GA-55'!L8","v":"SR. TEACHER"},null,null,"PAN :",{"$f":"'GA-55'!R8","v":"ASQPM6311H"}]
[null,2,"vk; %  o\"kZ&2021&22 esa izkIr dqy osru ¼ dj ;ksX; lqfo/kkvksa ds eqY; lfgr ½",{"$nulls":12},"#-",{"$f":"IF('GA-55'!Z2=\"GPF\",'GA-55'!N32,('GA-55'!N32+'GA-55'!O32))","v":{"v":849302,"d":"849302.00"}}]
[null,3,"x`g fdjk;k] /kkjk 10¼13&A½ ds vUrxrZ ,oa /kkjk 10¼14½ds vUrxrZ vU; Hkrs tks dj eqDÙk gSA",{"$nulls":12},"#-",{"$f":"'Other Deduction'!B3","v":{"v":0,"d":"0.00"}}]
[null,4,"                                                              'ks\"k ¼2&3½",{"$nulls":12},"#-",{"$f":"Q4-Q5","v":{"v":849302,"d":"849302.00"}}]
[null,5," ¼i½ euksjatu Hkrk /kkjk 16 ¼ii½ ds vUrxrZ ¼ vf/kdre lhek : 5000 ½",{"$nulls":9},{"$f":"'Other Deduction'!B4","v":{"v":0,"d":"0.00"}}]
[null,null," ¼ii½ O;o;k; dj /kkjk 16 ¼iii½ ds vUrxrZ ",{"$nulls":9},{"$f":"'Other Deduction'!B5","v":{"v":0,"d":"0.00"}}]
[null,null," ¼iiI½ LVs.MMZ fMMsD'ku (Standard Deduction)  50]000 ¼vf/kdre½",{"$nulls":9},{"$f":"IF(Q6<50000,Q6,50000)","v":{"v":50000,"d":"50000.00"}},null,null,"#-",{"$f":"SUM(M7:O9)","v":{"v":50000,"d":"50000.00"}}]
[null,6,"                                                           'ks\"k ¼4&5½",{"$nulls":12},"#-",{"$f":"Q6-Q9","v":{"v":799302,"d":"799302.00"}}]
[null,7,"¼v½x`g lEifr ls vk;%¼1½ Loa; ds mi;ksx esa &'kwU;",{"$nulls":7},"¼2½ izkIr fdjk;k #-",null,{"$f":"'Other Deduction'!B6","v":{"v":0,"d":"0.00"}}]
[null,null,"¼c½ ?kVk;sa ",null," fdjk;s dk 30%",null,null," x`g _.k ij C;kt",null,null," x`gdj ",null,"  ;ksx 7¼c½"]
[{"$nulls":4},{"$f":"ROUND(M11*0.3,0)","v":{"v":0,"d":"0.00"}},null,null,{"$f":"IF(('GA-55'!W32+'Other Deduction'!B9)>200000,200000,('GA-55'!W32+'Other Deduction'!B9))","v":{"v":0,"d":"0.00"}},null,null,{"$f":"'Other Deduction'!B7","v":{"v":0,"d":"0.00"}},null,{"$f":"E13+H13+K13","v":{"v":0,"d":"0.00"}}]
[null,null,"                                                          'ks\"k &@$¼7¼v½ ,oa ;ksx 7¼c½ dk½  ",{"$nulls":12},"#-",{"$f":"M11-M13","v":{"v":0,"d":"0.00"}}]
[null,8,"                                                             dqy 'ks\"k &@$¼6,oa 7½",{"$nulls":12},"#-",{"$f":"Q10+Q14","v":{"v":799302,"d":"799302.00"}}]
{"$rows_left_out":51}
{"sheet":"Tax New Regime","index":4,"n_rows":68,"n_cols":17,"rows_kept":68,"merged":[[0,1,0,16],[1,1,1,16],[2,2,2,3],[2,4,2,9],[2,11,2,13],[2,15,2,16],[3,2,3,14],[4,2,4,14],[5,2,5,14],[6,1,8,1],[6,2,6,11],[6,12,6,14],[6,15,7,16],[7,2,7,11],[7,12,7,14],[8,2,8,11],[8,12,8,14],[9,2,9,14],[10,1,12,1],[10,2,10,9],[10,10,10,11],[10,12,10,14],[10,15,12,16],[11,2,12,3],[11,4,11,6],[11,7,11,9],[11,10,11,11],[11,12,11,14],[12,4,12,6],[12,7,12,9],[12,10,12,11],[12,12,12,14],[13,2,13,14],[14,2,14,14],[15,2,15,14],[16,2,16,14],[17,1,33,1],[17,2,17,16],[18,2,18,16],[19,3,19,6],[19,10,19,12],[19,15,29,16],[20,3,20,6],[20,10,20,12],[21,3,21,6],[21,10,21,12],[22,3,22,6],[22,10,22,12],[23,3,23,6],[23,10,23,12],[24,3,24,6],[24,10,24,12],[25,3,25,6],[25,10,25,12],[26,3,26,6],[26,10,26,12],[27,3,27,6],[27,10,27,12],[28,3,28,6],[28,10,28,12],[29,2,29,12],[30,2,30,14],[31,2,31,14],[32,2,32,14],[33,2,33,14],[34,1,43,1],[34,2,34,16],[35,2,35,14],[36,2,36,14],[37,2,37,14],[38,2,38,14],[39,2,39,14],[40,2,40,14],[41,2,41,14],[42,2,42,14],[43,2,43,14],[44,2,44,14],[45,2,45,14],[46,2,46,14],[47,1,60,1],[47,2,47,16],[48,2,48,6],[48,7,48,10],[48,11,48,14],[49,2,49,4],[49,5,49,6],[49,7,49,9],[49,11,49,13],[50,2,50,4],[50,5,50,6],[50,7,50,9],[50,11,50,13],[51,2,51,4],[51,5,51,6],[51,7,51,9],[51,11,51,13],[52,2,52,4],[52,5,52,6],[52,7,52,9],[52,11,52,13],[53,2,53,4],[53,5,53,6],[53,7,53,9],[53,11,53,13],[54,2,54,4],[54,5,54,6],[54,7,54,9],[54,11,54,13],[55,2,55,4],[55,5,55,6],[55,7,55,9],[55,11,55,13],[56,2,56,14],[57,2,57,14],[58,2,58,14],[59,2,59,14],[60,2,60,14],[61,2,61,14],[62,2,62,14],[63,1,64,1],[63,2,64,4],[63,5,63,8],[63,9,63,10],[63,12,63,13],[63,15,63,16],[64,5,64,8],[64,9,64,10],[64,12,64,13],[64,15,64,16],[65,1,65,14],[69,2,71,16],[72,11,78,16],[77,3,77,9]]}
[null,{"$f":"'GA-55'!D6","v":"GOVT. SR. SECONDARY SCHOOL, DILOD HATHI, ATRU BARAN"}]
[null,"vk;dj x.kuk izi= o\"kZ 2021&2022 ¼dj fu/kkZj.k o\"kZ 2022&2023½"]
[null,1,"uke deZpkjh %",null,{"$f":"'GA-55'!D8","v":"PARMANAND MEGHWAL"},{"$nulls":5}," in %",{"$f":"'GA-55'!L8","v":"SR. TEACHER"},null,null,"PAN :",{"$f":"'GA-55'!R8","v":"ASQPM6311H"}]
[null,2,"vk; %  o\"kZ&2021&22 esa izkIr dqy osru ¼ dj ;ksX; lqfo/kkvksa ds eqY; lfgr ½",{"$nulls":12},"#-",{"$f":"IF('GA-55'!Z2=\"No\",'GA-55'!N32,('GA-55'!N32+'GA-55'!O32))","v":{"v":849302,"d":"849302.00"}}]
[null,3,"x`g fdjk;k] /kkjk 10¼13&A½ ds vUrxrZ ,oa /kkjk 10¼14½ds vUrxrZ vU; Hkrs tks dj eqDÙk gSA",{"$nulls":12},"#-",{"v":0,"d":"0.00"}]
[null,4,"                                                              'ks\"k ¼2&3½",{"$nulls":12},"#-",{"$f":"Q4-Q5","v":{"v":849302,"d":"849302.00"}}]
[null,5," ¼i½euksjatu Hkrk /kkjk 16 ¼ii½ ds vUrxrZ ¼ vf/kdre lhek : 5000 ½",{"$nulls":9},{"$f":"'Other Deduction'!B4","v":{"v":0,"d":"0.00"}}]
[null,null," ¼ii½ O;o;k; dj /kkjk 16 ¼iii½ ds vUrxrZ ",{"$nulls":9},{"$f":"'Other Deduction'!B5","v":{"v":0,"d":"0.00"}}]
[null,null," ¼iiI½ LVs.MMZ fMMsD'ku (Standard Deduction)  50]000 ¼vf/kdre½",{"$nulls":9},{"v":0,"d":"0.00"},null,null,"#-",{"$f":"SUM(M7:O9)","v":{"v":0,"d":"0.00"}}]
[null,6,"                                                           'ks\"k ¼4&5½",{"$nulls":12},"#-",{"$f":"Q6-Q9","v":{"v":849302,"d":"849302.00"}}]
[null,7,"¼v½x`g lEifr ls vk;%¼1½ Loa; ds mi;ksx esa &'kwU;",{"$nulls":7},"¼2½ izkIr fdjk;k #-",null,{"v":0,"d":"0.00"}]
[null,null,"¼c½ ?kVk;sa ",null," fdjk;s dk 30%",null,null," x`g _.k ij C;kt",null,null," x`gdj ",null,"  ;ksx 7¼c½"]
[{"$nulls":4},{"$f":"ROUND(M11*0.3,0)","v":{"v":0,"d":"0.00"}},null,null,{"v":0,"d":"0.00"},null,null,{"$f":"'Other Deduction'!B7","v":{"v":0,"d":"0.00"}},null,{"$f":"E13+H13+K13","v":{"v":0,"d":"0.00"}}]
[null,null,"                                                          'ks\"k &@$¼7¼v½ ,oa ;ksx 7¼c½ dk½  ",{"$nulls":12},"#-",{"$f":"M11-M13","v":{"v":0,"d":"0.00"}}]
[null,8,"                                                             dqy 'ks\"k &@$¼6,oa 7½",{"$nulls":12},"#-",{"$f":"Q10+Q14","v":{"v":849302,"d":"849302.00"}}]
{"$rows_left_out":54}
{"sheet":"Form 16","index":5,"n_rows":157,"n_cols":12,"rows_kept":157,"merged":[[0,0,0,11],[1,0,1,11],[2,0,2,11],[3,0,3,11],[4,0,4,11],[5,0,5,5],[5,6,5,11],[6,0,6,5],[6,6,6,11],[7,0,7,5],[7,6,7,11],[8,0,9,5],[8,6,9,11],[10,0,10,2],[10,3,10,5],[10,6,10,11],[11,0,11,2],[11,3,11,5],[11,6,11,11],[12,3,14,5],[12,6,12,8],[12,9,12,11],[13,6,13,7],[13,9,14,11],[14,6,14,7],[16,0,16,1],[16,2,16,4],[16,5,16,6],[16,7,16,9],[16,10,16,11],[17,0,17,1],[17,2,17,4],[17,5,17,6],[17,7,17,9],[17,10,17,11],[18,0,18,1],[18,2,18,4],[18,5,18,6],[18,7,18,9],[18,10,18,11],[19,0,19,1],[19,2,19,4],[19,5,19,6],[19,7,19,9],[19,10,19,11],[20,0,20,1],[20,2,20,4],[20,5,20,6],[20,7,20,9],[20,10,20,11],[21,0,21,1],[21,2,21,4],[21,5,21,6],[21,7,21,9],[21,10,21,11],[22,0,22,11],[23,1,23,3],[23,4,23,11],[24,1,24,3],[24,4,24,5],[24,6,24,7],[24,8,24,9],[24,10,24,11],[25,4,25,5],[25,6,25,7],[25,8,25,9],[25,10,25,11],[26,1,26,3],[26,6,26,7],[26,8,26,9],[27,1,27,3],[27,4,27,5],[27,6,27,7],[27,8,27,9],[28,1,28,3],[28,4,28,5],[28,6,28,7],[28,8,28,9],[29,1,29,3],[30,1,30,3],[31,1,31,3],[32,1,32,3],[33,1,33,3],[34,1,34,3],[35,1,35,3],[35,4,35,5],[35,6,35,7],[35,8,35,9],[36,1,36,3],[36,4,36,5],[36,6,36,7],[36,8,36,9],[37,1,37,3],[37,4,37,5],[37,6,37,7],[37,8,37,9],[38,1,38,3],[38,4,38,5],[38,6,38,7],[38,8,38,9],[39,1,39,3],[40,1,40,3],[40,4,40,5],[40,6,40,7],[40,8,40,9],[42,0,42,11],[43,1,43,3],[43,4,43,11],[44,1,44,3],[44,4,44,5],[44,6,44,7],[44,8,44,9],[44,10,44,11],[45,4,45,5],[45,6,45,7],[45,8,45,9],[45,10,45,11],[46,1,46,3],[46,6,46,7],[46,8,46,9],[47,1,47,3],[47,6,47,7],[47,8,47,9],[48,1,48,3],[48,6,48,7],[48,8,48,9],[49,1,49,3],[49,6,49,7],[49,8,49,9],[50,1,50,3],[50,6,50,7],[50,8,50,9],[51,1,51,3],[51,6,51,7],[51,8,51,9],[52,1,52,3],[52,6,52,7],[52,8,52,9],[53,1,53,3],[53,6,53,7],[53,8,53,9],[54,1,54,3],[54,6,54,7],[54,8,54,9],[55,1,55,3],[55,6,55,7],[55,8,55,9],[56,1,56,3],[56,6,56,7],[56,8,56,9],[57,1,57,3],[57,6,57,7],[57,8,57,9],[58,1,58,3],[58,6,58,7],[58,8,58,9],[59,1,59,3],[60,1,60,3],[60,4,60,5],[60,6,60,11],[61,0,61,11],[62,1,62,3],[62,6,62,8],[63,0,63,2],[63,9,63,10],[64,0,64,4],[65,0,66,11],[67,0,67,1],[68,0,68,11],[69,0,69,11],[70,0,70,11],[71,0,71,11],[72,0,72,6],[73,0,73,11],[74,0,74,11],[75,0,75,11],[76,0,76,11],[77,0,77,11],[78,0,78,4],[81,0,81,11],[82,0,82,11],[89,9,89,10],[92,0,92,6],[93,0,93,6],[94,9,94,10],[108,6,110,7],[108,8,110,9],[108,10,110,11],[109,0,109,3],[111,6,111,7],[111,8,111,9],[111,10,111,11],[112,2,112,4],[112,6,112,7],[112,8,112,9],[112,10,112,11],[113,2,113,4],[113,6,113,7],[113,8,113,9],[113,10,113,11],[114,2,114,4],[114,6,114,7],[114,8,114,9],[114,10,114,11],[115,2,115,4],[115,6,115,7],[115,8,115,9],[115,10,115,11],[116,6,116,7],[116,8,116,9],[116,10,116,11],[117,6,117,7],[117,8,117,9],[117,10,117,11],[118,2,118,4],[118,6,118,7],[118,8,118,9],[118,10,118,11],[119,6,119,7],[119,8,119,9],[119,10,119,11],[120,6,120,7],[120,8,120,9],[120,10,120,11],[121,6,121,7],[121,8,121,9],[121,10,121,11],[124,6,124,7],[124,8,124,9],[124,10,124,11],[125,6,125,7],[125,8,125,9],[125,10,125,11],[128,8,128,9],[128,10,128,11],[129,2,129,4],[129,6,129,7],[129,8,129,9],[129,10,129,11],[130,2,130,4],[130,6,130,7],[130,8,130,9],[130,10,130,11],[131,2,131,4],[131,6,131,7],[131,8,131,9],[131,10,131,11],[132,6,132,7],[132,8,132,9],[132,10,132,11],[133,10,133,11],[134,10,134,11],[136,10,136,11],[137,10,137,11],[138,10,138,11],[139,10,139,11],[140,10,140,11],[141,10,141,11],[142,10,142,11],[143,10,143,11],[144,10,144,11],[145,0,145,11],[146,1,146,3],[146,6,146,8],[147,0,147,2],[148,0,148,11],[153,5,153,11],[154,5,154,11],[155,0,155,2],[155,7,155,11],[156,0,156,2],[156,7,156,11],[157,5,157,11]]}
["FORM NO.16"]
["[See rule 31 (1) (a)]"]
["Part A"]
["Certificate under section 203 of the Income Tax Act, 1961 for tax deducted"]
["at source from income chargeable under the head  “ Salaries “"]
["Name and address of the employer",{"$nulls":5},"Name and Designation of the employee"]
[{"$f":"'Basic Profile'!O3","v":"HANUMAN SAHAY"},{"$nulls":5},{"$f":"'GA-55'!D8","v":"PARMANAND MEGHWAL"}]
[{"$f":"'Basic Profile'!O5","v":"PRINCIPAL"},{"$nulls":5},{"$f":"'GA-55'!L8","v":"SR. TEACHER"}]
[{"$f":"'Basic Profile'!C6","v":"GOVT. SR. SECONDARY SCHOOL, DILOD HATHI, ATRU BARAN"},{"$nulls":5},{"$f":"'GA-55'!D6","v":"GOVT. SR. SECONDARY SCHOOL, DILOD HATHI, ATRU BARAN"}]
[]
["PAN of the Deducter",null,null,"TAN of the Deducter",null,null,"PAN of the Employee"]
[{"$nulls":3},{"$f":"'Basic Profile'!Q6","v":"XXXX9987D"},null,null,{"$f":"'GA-55'!R8","v":"ASQPM6311H"}]
["TDS Circle where annual",{"$nulls":5},"PERIOD",null,null,"Assessment Year"]
["return / statement under",{"$nulls":5},"FROM",null,"TO","2022-23"]
["section 206 is to be filed",{"$nulls":5},"01.04.2021",null,"31.03.2022"]
{"$rows_left_out":143}
{"sheet":"HRA Receipt","index":6,"n_rows":24,"n_cols":9,"rows_kept":24,"merged":[[0,0,0,9],[1,0,2,9],[6,2,6,9],[7,2,7,5],[7,6,7,9],[8,2,8,9],[9,4,9,9],[10,1,10,3],[10,5,10,9],[11,1,11,2],[11,3,11,5],[13,2,13,3],[15,2,15,3],[17,7,17,9],[18,7,18,9],[19,8,19,9],[20,7,20,9],[21,7,22,9],[23,7,23,8]]}
["RECEIPT OF HOUSE RENT"]
["(Under section 1 (13-A) of Income Tax Act)"]
[]
[]
[{"$nulls":8},"Date :-"]
[]
[null,"I Owner "]
[null,null,"Received with Thanks from Sri/Smt. ",{"$nulls":3},"---------------------------------------------------------------------------------------------"]
[null,"Address-","---------------------------------------------------------------------------------------------------------------------------------------------------"]
[null,"The sum of ","Rs.="]
[null,"Towards the House Rent @  Rs. ="]
[null,"Per Month From :-",null,"April 2020 To March 2021"]
[]
[null,"Rs.  =  "]
[]
{"$rows_left_out":9}